[Bug 60535] New: loader/preloader.o: collect2: error: ld returned 1 exit status
http://bugs.winehq.org/show_bug.cgi?id=60535 Bug ID: 60535 Summary: loader/preloader.o: collect2: error: ld returned 1 exit status Product: Wine Version: 11.20 Hardware: x86-64 OS: Linux Status: UNCONFIRMED Severity: normal Priority: P2 Component: loader Assignee: wine-bugs@list.winehq.org Reporter: patrick+winehq.org@laimbock.com Target Milestone: --- Distribution: --- Created attachment 82396 --> http://bugs.winehq.org/attachment.cgi?id=82396 Log lines of loader/ from wine-11.20 build failure on F45 Building wine 11.20 (no staging) on Fedora 45 x86_64 with gcc-16.2.1, glibc-2.44 fails while building it on Fedora 44 succeeds. Shortened error: gcc -m64 -o loader/wine-preloader loader/preloader.o loader/preloader_mac.o -nostartfiles -nodefaultlibs -static -Wl,-Ttext=0x7d7d00000000 loader/preloader.o: in function `wld_vsprintf': ... /builddir/build/BUILD/wine-11.20-build/wine-11.20/loader/preloader.c:1151:(.text+0xc2b): additional relocation overflows omitted from the output collect2: error: ld returned 1 exit status Log attached. A full build log of wine 11.20+staging+patches with the same error is at: https://download.copr.fedorainfracloud.org/results/patrickl/wine-staging-dev... Please let me know if you need more information. -- Do not reply to this email, post in Bugzilla using the above URL to reply. You are receiving this mail because: You are watching all bug changes.
participants (1)
-
WineHQ Bugzilla