http://bugs.winehq.org/show_bug.cgi?id=25037
Summary: Microsoft Tinker Doesn't Render, Gameplay not possible
Product: Wine
Version: 1.3.6
Platform: x86
OS/Version: Linux
Status: UNCONFIRMED
Severity: normal
Priority: P2
Component: -unknown
AssignedTo: wine-bugs(a)winehq.org
ReportedBy: shannon.vanwagner(a)gmail.com
Created an attachment (id=31732)
--> (http://bugs.winehq.org/attachment.cgi?id=31732)
zipped WINEDEBUG=+module debug log
Game installs and launches, but produces only a black screen with "Game" and
"Help" menus. ahk reveals the main window as "MainWindowClass1",
"RenderWindow".
Tried 'winetricks wmp10 gfw d3dx9 vcrun2008 gameux=disabled' but no joy. Also
am seeing some errors that seem to be related to gameux not being found, so I
tried manually copying/overriding it... still no joy.
See debug attachment.
--
Configure bugmail: http://bugs.winehq.org/userprefs.cgi?tab=email
Do not reply to this email, post in Bugzilla using the
above URL to reply.
------- You are receiving this mail because: -------
You are watching all bug changes.
http://bugs.winehq.org/show_bug.cgi?id=5202
Jerome Leclanche <adys.wh(a)gmail.com> changed:
What |Removed |Added
----------------------------------------------------------------------------
Resolution|WONTFIX |UPSTREAM
--- Comment #25 from Jerome Leclanche <adys.wh(a)gmail.com> ---
Changing resolution to upstream.
--
Do not reply to this email, post in Bugzilla using the
above URL to reply.
You are receiving this mail because:
You are watching all bug changes.
https://bugs.winehq.org/show_bug.cgi?id=35751
Bug ID: 35751
Summary: Cannot launch One Finger Death Punch from Steam
Product: Wine
Version: 1.7.14
Hardware: x86
OS: Linux
Status: NEW
Severity: normal
Priority: P2
Component: -unknown
Assignee: wine-bugs(a)winehq.org
Reporter: adys.wh(a)gmail.com
The following console output appears:
-----
fixme:heap:HeapSetInformation (nil) 1 (nil) 0
Can't recognize 'C:\Program Files (x86)\Steam\steamapps\common\One Finger Death
Punch\_CommonRedist\DotNet\4.0 Client Profile\Microsoft .NET Framework 4.0
Client Profile.cmd ' as an internal or external command, or batch script.
Install script executed.err:module:import_dll Loading library MSVCR100.dll
(which is needed by
L"C:\\windows\\Microsoft.NET\\assembly\\GAC_32\\Microsoft.Xna.Framework.Graphics\\v4.0_4.0.0.0__842cf8be1de50553\\Microsoft.Xna.Framework.Graphics.dll")
failed (error c000007b).
err:mscoree:mono_assembly_preload_hook_fn Failed to load
L"C:\\windows\\Microsoft.NET\\assembly\\GAC_32\\Microsoft.Xna.Framework.Graphics\\v4.0_4.0.0.0__842cf8be1de50553\\Microsoft.Xna.Framework.Graphics.dll",
status=1
err:module:import_dll Loading library MSVCR100.dll (which is needed by
L"C:\\windows\\Microsoft.NET\\assembly\\GAC_32\\Microsoft.Xna.Framework\\v4.0_4.0.0.0__842cf8be1de50553\\Microsoft.Xna.Framework.dll")
failed (error c000007b).
err:module:import_dll Loading library msvcr100.dll (which is needed by
L"C:\\windows\\system32\\msvcp100.dll") failed (error c000007b).
err:module:import_dll Loading library MSVCP100.dll (which is needed by
L"C:\\windows\\Microsoft.NET\\assembly\\GAC_32\\Microsoft.Xna.Framework\\v4.0_4.0.0.0__842cf8be1de50553\\Microsoft.Xna.Framework.dll")
failed (error c000007b).
err:mscoree:mono_assembly_preload_hook_fn Failed to load
L"C:\\windows\\Microsoft.NET\\assembly\\GAC_32\\Microsoft.Xna.Framework\\v4.0_4.0.0.0__842cf8be1de50553\\Microsoft.Xna.Framework.dll",
status=1
Unhandled Exception:
System.TypeLoadException: Could not load type 'One_Finger_Death_Punch.Game1'
from assembly 'One Finger Death Punch, Version=1.0.0.0, Culture=neutral,
PublicKeyToken=null'.
[ERROR] FATAL UNHANDLED EXCEPTION: System.TypeLoadException: Could not load
type 'One_Finger_Death_Punch.Game1' from assembly 'One Finger Death Punch,
Version=1.0.0.0, Culture=neutral, PublicKeyToken=null'.
-----
These are the contents of "Microsoft .NET Framework 4.0 Client Profile.cmd"
@ECHO OFF
start /w "" "%~dp0\dotNetFx40_Client_x86_x64.exe" /q /norestart
IF %ERRORLEVEL% == 3010 EXIT /B 0
EXIT /B %ERRORLEVEL%
Trying to manually run wine start Microsoft\ .NET\ Framework\ 4.0\ Client\
Profile.cmd opens a wineconsole window for a split second that says
"Application could not be started or no application associated with the
specified file".
Oddly, this happens even with vcrun2010 installed. The following files are
present in the prefix:
/home/adys/.local/share/wineprefixes/steam/drive_c/windows/system32/msvcr100.dll
/home/adys/.local/share/wineprefixes/steam/drive_c/windows/syswow64/msvcr100.dll
I'm trying to reproduce all this in a cleaner prefix, unfortunately I am
getting issues opening steam from there. It'll have to wait.
I have a spare key to One Finger Death Punch, by the way, so I'm happy to give
it to a dev volunteering to take on this bug.
--
Do not reply to this email, post in Bugzilla using the
above URL to reply.
You are receiving this mail because:
You are watching all bug changes.
https://bugs.winehq.org/show_bug.cgi?id=3161
Jarkko K <jarkko_korpi(a)hotmail.com> changed:
What |Removed |Added
----------------------------------------------------------------------------
CC| |jarkko_korpi(a)hotmail.com
--- Comment #11 from Jarkko K <jarkko_korpi(a)hotmail.com> ---
What's the current status?
--
Do not reply to this email, post in Bugzilla using the
above URL to reply.
You are receiving this mail because:
You are watching all bug changes.
https://bugs.winehq.org/show_bug.cgi?id=8563
Jarkko K <jarkko_korpi(a)hotmail.com> changed:
What |Removed |Added
----------------------------------------------------------------------------
CC| |jarkko_korpi(a)hotmail.com
--- Comment #37 from Jarkko K <jarkko_korpi(a)hotmail.com> ---
https://ia601206.us.archive.org/32/items/Mechwarrior4VengeanceDemo/Mech4.zip
Should work as direct download link.
Any update?
--
Do not reply to this email, post in Bugzilla using the
above URL to reply.
You are receiving this mail because:
You are watching all bug changes.
https://bugs.winehq.org/show_bug.cgi?id=8697
Henri Verbeet <hverbeet(a)gmail.com> changed:
What |Removed |Added
----------------------------------------------------------------------------
Component|directx-d3d |user32
--
Do not reply to this email, post in Bugzilla using the
above URL to reply.
You are receiving this mail because:
You are watching all bug changes.
https://bugs.winehq.org/show_bug.cgi?id=8697
--- Comment #18 from Henri Verbeet <hverbeet(a)gmail.com> ---
Created attachment 47740
--> https://bugs.winehq.org/attachment.cgi?id=47740
patch
I think this patch should help for the text, although it probably needs a test.
You may need to delete .vpcache filesfor things to show up correctly.
--
Do not reply to this email, post in Bugzilla using the
above URL to reply.
You are receiving this mail because:
You are watching all bug changes.
http://bugs.winehq.org/show_bug.cgi?id=21526
Summary: several programs fail to compile under cygwin
Product: Wine
Version: 1.1.37
Platform: x86
URL: http://www.cygwin.com
OS/Version: Windows XP
Status: NEW
Keywords: download, source
Severity: enhancement
Priority: P2
Component: build-env
AssignedTo: wine-bugs(a)winehq.org
ReportedBy: austinenglish(a)gmail.com
Seems to be related to command line arguments:
cmd.exe-HRRQ2O.c: In function `main':
cmd.exe-HRRQ2O.c:5: error: `__wargv' undeclared (first use in this function)
cmd.exe-HRRQ2O.c:5: error: (Each undeclared identifier is reported only once
cmd.exe-HRRQ2O.c:5: error: for each function it appears in.)
Also affects:
dxdiag.exe-8dF1r2.c:5: error: `__wargv' undeclared (first use in this function)
explorer.exe-huqBP4.c:5: error: `__wargv' undeclared (first use in this
function)
extrac32.exe-ZBAgOk.c:5: error: `__wargv' undeclared (first use in this
function)
mshta.exe-ivENd9.c:5: error: `__wargv' undeclared (first use in this function)
reg.exe-bHwntd.c:5: error: `__wargv' undeclared (first use in this function)
start.exe-LokQFy.c:5: error: `__wargv' undeclared (first use in this function)
svchost.exe-ntfQ5M.c:5: error: `__wargv' undeclared (first use in this
function)
termsv.exe-aacxDf.c:5: error: `__wargv' undeclared (first use in this function)
uninstaller.exe-iXvRef.c:5: error: `__wargv' undeclared (first use in this
function)
winebrowser.exe-zWnYcC.c:5: error: `__wargv' undeclared (first use in this
function)
winedevice.exe-SvwxgZ.c:5: error: `__wargv' undeclared (first use in this
function)
winepath.exe-guBaBG.c:5: error: `__wargv' undeclared (first use in this
function)
xcopy.exe-0dP3a3.c:5: error: `__wargv' undeclared (first use in this function)
Notepad/regedit have a different (but possibly related) problem:
dialog.o: In function `DIALOG_Search':
/home/austin/wine-git/programs/notepad/dialog.c:1059: undefined reference to
`___assert_func'
dialog.o: In function `DIALOG_Replace':
/home/austin/wine-git/programs/notepad/dialog.c:1093: undefined reference to
`___assert_func'
hexedit.o: In function `HexEdit_WindowProc':
/home/austin/wine-git/programs/regedit/hexedit.c:307: undefined reference to
`___assert_func'
regproc.o: In function `import_registry_file':
/home/austin/wine-git/programs/regedit/regproc.c:671: undefined reference to
`___assert_func'
collect2: ld returned 1 exit status
Other than this, when using CFLAGS="-D _WIN32" the compile works.
--
Configure bugmail: http://bugs.winehq.org/userprefs.cgi?tab=email
Do not reply to this email, post in Bugzilla using the
above URL to reply.
------- You are receiving this mail because: -------
You are watching all bug changes.
https://bugs.winehq.org/show_bug.cgi?id=5928
Anastasius Focht <focht(a)gmx.net> changed:
What |Removed |Added
----------------------------------------------------------------------------
Status|NEW |RESOLVED
Resolution|--- |FIXED
Summary|Bad fields in Timeless Time |Timeless Time and Expense
|and Expense |3.0: bad fields in
| |calendar/time entries
--- Comment #23 from Anastasius Focht <focht(a)gmx.net> ---
Hello folks,
installs fine now.
Adding and editing of time entries in calendar works too.
Prerequisites for v3.0:
'winetricks -q dotnet20' (if Mono not present)
'winetricks -q mdac28 jet40' (creating the databases)
Resolving 'fixed'.
Reopen if still a problem with recent Wine version but make sure to exactly
describe the problem (steps needed, attach screenshots for comparison).
$ sha1sum TimelessTimeAndExpenseWindowsSetup.exe
c0f32c3d55bce43bb5f026b5dd2938203d00bac6
TimelessTimeAndExpenseWindowsSetup.exe
$ du -sh TimelessTimeAndExpenseWindowsSetup.exe
13M TimelessTimeAndExpenseWindowsSetup.exe
$ wine --version
wine-1.7.14
Regards
--
Do not reply to this email, post in Bugzilla using the
above URL to reply.
You are receiving this mail because:
You are watching all bug changes.
http://bugs.winehq.org/show_bug.cgi?id=22918
Summary: Ship Simulator 2008 demo crashes on startup (needs
D3DXCreateSphere)
Product: Wine
Version: unspecified
Platform: x86
URL: http://www.shipsim.com/downloads/trailers
OS/Version: Linux
Status: NEW
Keywords: download
Severity: normal
Priority: P2
Component: directx-d3d
AssignedTo: wine-bugs(a)winehq.org
ReportedBy: madewokherd(a)gmail.com
Created an attachment (id=28358)
--> (http://bugs.winehq.org/attachment.cgi?id=28358)
console log, from wine-1.2-rc1-179-gdd09205
When installed with nothing else in a clean wine prefix, Ship Simulator 2008
crashes on startup.
wine: Call from 0x7b836a02 to unimplemented function
d3dx9_36.dll.D3DXCreateSphere, aborting
Before that, it hits a number of d3dx stubs, so even when this is implemented,
it will likely not work properly.
--
Configure bugmail: http://bugs.winehq.org/userprefs.cgi?tab=email
Do not reply to this email, post in Bugzilla using the
above URL to reply.
------- You are receiving this mail because: -------
You are watching all bug changes.