https://bugs.winehq.org/show_bug.cgi?id=38052
Bug ID: 38052
Summary: dsound.dll results in very choppy audio
Product: Wine
Version: 1.7.36
Hardware: x86-64
OS: Mac OS X
Status: UNCONFIRMED
Severity: normal
Priority: P2
Component: directx-dsound
Assignee: wine-bugs(a)winehq.org
Reporter: therealhdl(a)gmail.com
Using the native dsound.dll override, as opposed to built-in Wine sound, makes
various applications have choppy/stuttering audio. I've mostly tested this
with emulators such as pSX, VBA-M, Regen, Kega Fusion, and Gens. Software
performance is overall better with dsound.dll enabled, apart from the audio
itself.
--
Do not reply to this email, post in Bugzilla using the
above URL to reply.
You are receiving this mail because:
You are watching all bug changes.
https://bugs.winehq.org/show_bug.cgi?id=37999
Bug ID: 37999
Summary: Wine-mono:
System.Security.Principal.WindowsIdentity.User is not
implemented
Product: Wine
Version: 1.7.35
Hardware: x86
OS: Linux
Status: NEW
Keywords: download, source, testcase
Severity: normal
Priority: P2
Component: mscoree
Assignee: wine-bugs(a)winehq.org
Reporter: fracting(a)gmail.com
Distribution: ---
This is an upstream bug https://bugzilla.xamarin.com/show_bug.cgi?id=26639
Duplicate here to get more attention, convenient for tracking bugs.
Chocolatey Package manager for Windows is able to run after work around this
bug and Bug 37996
--
Do not reply to this email, post in Bugzilla using the
above URL to reply.
You are receiving this mail because:
You are watching all bug changes.
http://bugs.winehq.org/show_bug.cgi?id=35911
Bug ID: 35911
Summary: Batman: Arkham Origins Blackgate crashes at launch
Product: Wine
Version: 1.7.15
Hardware: x86
OS: Linux
Status: UNCONFIRMED
Severity: normal
Priority: P2
Component: directx-d3d
Assignee: wine-bugs(a)winehq.org
Reporter: andrey.goosev(a)gmail.com
Created attachment 47959
--> http://bugs.winehq.org/attachment.cgi?id=47959
log
First time requires for d3dcompiler_43 (err:d3dcompiler:compile_shader HLSL
shader parsing failed). Only native d3dcompiler_43 resolves the problem. After
that crashes at launch.
--
Do not reply to this email, post in Bugzilla using the
above URL to reply.
You are receiving this mail because:
You are watching all bug changes.
https://bugs.winehq.org/show_bug.cgi?id=37992
Bug ID: 37992
Summary: Across Personal Edition 6.0 installation fails with
"Access denied" error
Product: Wine
Version: 1.7.35
Hardware: x86-64
OS: Linux
Status: UNCONFIRMED
Severity: normal
Priority: P2
Component: -unknown
Assignee: wine-bugs(a)winehq.org
Reporter: psychonaut(a)nothingisreal.com
Distribution: ---
Created attachment 50623
--> https://bugs.winehq.org/attachment.cgi?id=50623
Log of unsuccessful installation of Across Personal Edition 6.0
I tried to install the Across Personal Edition 6.0 translation memory software
(available from
<ftp://ftp.across.net/across_6.0/Across_v6.0_Personal_Edition.zip>). I used
winecfg to set the Windows version to Windows 7 and ran Across.Setup.exe. The
installer fails with the error message "0x80070005 - Access denied". Attached
is the installation log.
Possibly this is an occurrence of Bug 33576.
--
Do not reply to this email, post in Bugzilla using the
above URL to reply.
You are receiving this mail because:
You are watching all bug changes.
http://bugs.winehq.org/show_bug.cgi?id=26307
Summary: Jaangle Media PLayer doesn't start/work
Product: Wine
Version: 1.3.15
Platform: x86
URL: http://www.jaangle.com/downloading?block
OS/Version: Linux
Status: UNCONFIRMED
Severity: normal
Priority: P2
Component: -unknown
AssignedTo: wine-bugs(a)winehq.org
ReportedBy: t.artem(a)mailcity.com
Created an attachment (id=33533)
--> (http://bugs.winehq.org/attachment.cgi?id=33533)
Startup error
$ ./jaangle.exe
fixme:keyboard:UnregisterHotKey ((nil),101): stub
fixme:keyboard:RegisterHotKey ((nil),176,0x00000000,B0): stub
err:ole:CoGetClassObject class {00000602-0000-0010-8000-00aa006d2ea4} not
registered
err:ole:CoGetClassObject class {00000602-0000-0010-8000-00aa006d2ea4} not
registered
err:ole:create_server class {00000602-0000-0010-8000-00aa006d2ea4} not
registered
fixme:ole:CoGetClassObject CLSCTX_REMOTE_SERVER not supported
err:ole:CoGetClassObject no class object {00000602-0000-0010-8000-00aa006d2ea4}
could be created for context 0x17
--
Configure bugmail: http://bugs.winehq.org/userprefs.cgi?tab=email
Do not reply to this email, post in Bugzilla using the
above URL to reply.
------- You are receiving this mail because: -------
You are watching all bug changes.
https://bugs.winehq.org/show_bug.cgi?id=38036
Bug ID: 38036
Summary: Unhandled exception: page fault on read access to
0x00000000 in 32-bit code (0x00f3eaae).
Product: Wine
Version: unspecified
Hardware: x86
OS: Linux
Status: UNCONFIRMED
Severity: normal
Priority: P2
Component: -unknown
Assignee: wine-bugs(a)winehq.org
Reporter: zenbuddha77(a)gmail.com
Distribution: ---
Created attachment 50672
--> https://bugs.winehq.org/attachment.cgi?id=50672
Unhandled exception: page fault on read access to 0x00000000 in 32-bit code
(0x00f3eaae).
Unhandled exception: page fault on read access to 0x00000000 in 32-bit code
(0x00f3eaae).
--
Do not reply to this email, post in Bugzilla using the
above URL to reply.
You are receiving this mail because:
You are watching all bug changes.
http://bugs.winehq.org/show_bug.cgi?id=34973
Bug #: 34973
Summary: Uru - Ages Beyond Myst Demo Can't finish game in
wine-1.3.21 without disabling sound.
Product: Wine
Version: 1.3.21
Platform: x86-64
OS/Version: Linux
Status: UNCONFIRMED
Severity: normal
Priority: P2
Component: msvcrt
AssignedTo: wine-bugs(a)winehq.org
ReportedBy: erichv(a)verizon.net
Classification: Unclassified
Created attachment 46602
--> http://bugs.winehq.org/attachment.cgi?id=46602
My fix for the problem arrived at after much experimentation and code study.
Uru - Ages Beyond Myst Demo works good enough to play completely in wine-1.3.20
but loses some of it's functionality and can't be completed in both wine-1.3.21
and wine-1.7.5. Disabling sound at the beginning of the game allows the game to
be played completely in both wine-1.3.21 and wine-1.7.5.
This is the regression test result:
19c4c37a1d16ce8790bbbfcda3c19eb753dba199 is the first bad commit
commit 19c4c37a1d16ce8790bbbfcda3c19eb753dba199
Author: Piotr Caban <piotr(a)codeweavers.com>
Date: Thu May 19 15:31:22 2011 +0200
msvcrt: Allocate FILE tables dynamically.
:040000 040000 8bae25f560b02bfbc2fbc7484ae98e947a91e608
c6e410abafefa5a00464f3ff645091dd27e74931 M dlls
--
Configure bugmail: http://bugs.winehq.org/userprefs.cgi?tab=email
Do not reply to this email, post in Bugzilla using the
above URL to reply.
------- You are receiving this mail because: -------
You are watching all bug changes.
https://bugs.winehq.org/show_bug.cgi?id=37979
Bug ID: 37979
Summary: Problem Installing/Compiling Wine 1.1.27 on Mac OS X
Product: Wine
Version: 1.1.27
Hardware: x86-64
OS: Mac OS X
Status: UNCONFIRMED
Severity: normal
Priority: P2
Component: setupapi
Assignee: wine-bugs(a)winehq.org
Reporter: rhezrhez(a)gmail.com
OS: Mac OS X 10.8.5
gcc/g++ version: 4.6.0
Error occurred after typing ./configure
config log dump:
gcc (GCC) 4.6.0
Copyright (C) 2011 Free Software Foundation, Inc.
This is free software; see the source for copying conditions. There is NO
warranty; not even for MERCHANTABILITY or FITNESS FOR A PARTICULAR PURPOSE.
configure:2737: $? = 0
configure:2744: gcc -v >&5
Using built-in specs.
COLLECT_GCC=gcc
COLLECT_LTO_WRAPPER=/usr/local/libexec/gcc/x86_64-apple-darwin10.7.0/4.6.0/lto-wrapper
Target: x86_64-apple-darwin10.7.0
Configured with: ../gcc-4.6.0/configure --enable-languages=fortran,c++
Thread model: posix
gcc version 4.6.0 (GCC)
configure:2748: $? = 0
configure:2755: gcc -V >&5
gcc: error: unrecognized option '-V'
gcc: fatal error: no input files
compilation terminated.
configure:2759: $? = 1
configure:2782: checking for C compiler default output file name
configure:2804: gcc conftest.c >&5
gcc: error trying to exec 'as': execvp: No such file or directory
configure:2808: $? = 1
configure:2846: result:
configure: failed program was:
| /* confdefs.h. */
| #define PACKAGE_NAME "Wine"
| #define PACKAGE_TARNAME "wine"
| #define PACKAGE_VERSION "1.1.27"
| #define PACKAGE_STRING "Wine 1.1.27"
| #define PACKAGE_BUGREPORT "wine-devel(a)winehq.org"
| /* end confdefs.h. */
|
| int
| main ()
| {
|
| ;
| return 0;
| }
I see two errors. Also an incomplete code file. Where is it located? Advice?
--
Do not reply to this email, post in Bugzilla using the
above URL to reply.
You are receiving this mail because:
You are watching all bug changes.
http://bugs.winehq.org/show_bug.cgi?id=9789
Summary: Unable to run XCOM in Wine
Product: Wine
Version: unspecified
Platform: Other
OS/Version: other
Status: UNCONFIRMED
Severity: enhancement
Priority: P2
Component: wine-files
AssignedTo: wine-bugs(a)winehq.org
ReportedBy: magsymp(a)yahoo.com
Hello,
I am running the most recent version of Wine on Ubuntu Feisty Fawn with all the
most recent updates. (I've even tried fresh install of Wine and Ubuntu)
My problem is that I am unable to get X Com UFO Defence to work with Wine. The
game will launch but the keyboard does NOT work. I've have extensive
troubleshooting but I can't get the keyboard to work. I have even had someone
else try to get it working (someone with alot of experience with Wine) and they
said that they were not able to get the keyboard working either (different PC
and all).
I have tried setting up a launcher script and had no success... same issue.
I've tried virtual KBs and those don't work either. I've even tried a KB which
should push input to all sessions but even that does NOT work.
I have tried to run the game in terminal, in seperate window, but the KB will
NOT work... or the game won't launch.
I've tried 3 different install packages for the game and still no success.
Other games work, and the keyboard works in them with no problems.
Game is now abondonware and is available at
http://www.abandonia.com/games/38/UF...emyUnknown.htm
or
http://www.the-underdogs.info/downlo...ld.zip&id=4966
Any investigation or input would be appreciated.
Thanks
--
Configure bugmail: http://bugs.winehq.org/userprefs.cgi?tab=email
------- You are receiving this mail because: -------
You are watching all bug changes.
https://bugs.winehq.org/show_bug.cgi?id=37993
Bug ID: 37993
Summary: Elsterformular-Installer: Unhandled exception: page
fault on rad access to 0x00000000
Product: Wine
Version: 1.7.35
Hardware: x86-64
OS: Linux
Status: UNCONFIRMED
Severity: normal
Priority: P2
Component: -unknown
Assignee: wine-bugs(a)winehq.org
Reporter: Andreas_Gajda(a)web.de
Distribution: ---
Created attachment 50624
--> https://bugs.winehq.org/attachment.cgi?id=50624
Backtrace
Wine crashes everytime with
"Unhandled exception: page fault on read access to 0x00000000 in 32-bit code
(0x003d1240)."
when using the ElsterFormular installer or the alternative main program
installer.
The crash occurs, when the installer tries to install the VC++2013 runtime
library.
ElsterFormular installer (whole bundle) ElsterFormular-16.0.20150113p.exe
available at
https://download.elster.de/download/2011/ElsterFormular-16.0.20150113p.exe
main programm installer install_pica.exe
available at https://download.elster.de/download/pm/web/install_pica.exe
Note, that there is a "free for private use" licence. It doesn't say anything
about use for debugging purposes ;-) Not sure about the implications.
Backtrace attached.
sha1sum ElsterFormular-16.0.20150113p.exe
e0a93ea1cb5ec51fb61c3d6950c63e7d19704a41 ElsterFormular-16.0.20150113p.exe
sha1sum install_pica.exe
5fd4a462c5ee88dce487c06bf1b262ec76ab7263 install_pica.exe
uname -a
Linux XXXXXXXX 3.14.14-gentoo #1 SMP PREEMPT Wed Sep 3 21:57:32 CEST 2014
x86_64 AMD E-350 Processor AuthenticAMD GNU/Linux
I tried to manually install VC++2013 runtime using winetricks, but it doesn't
make a difference. Installer still crashes and the application doesn't start.
--
Do not reply to this email, post in Bugzilla using the
above URL to reply.
You are receiving this mail because:
You are watching all bug changes.