http://bugs.winehq.org/show_bug.cgi?id=28716
Bug #: 28716
Summary: LNToGoogle is unable to connect to google calendar -
thinks it's behind a proxy
Product: Wine
Version: 1.3.24
Platform: x86
OS/Version: Linux
Status: UNCONFIRMED
Severity: normal
Priority: P2
Component: -unknown
AssignedTo: wine-bugs(a)winehq.org
ReportedBy: robert.munteanu(a)gmail.com
Classification: Unclassified
1. Download program from http://sourceforge.net/projects/lntogoogle/
2. Install mono ( winetricks mono210 )
3. Run the program and enter Google Calendar username/passoword ( not
necessarily valid ones )
Instead of getting a login success or error message, I am informed that I am
possibly behind a proxy which requires username/passowrd to connect to the
internet.
Terminal output:
fixme:gdi:ExtCreatePen Hatches not implemented
err:ole:CoGetClassObject class {29131539-2eed-1069-bf5d-00dd011186b7} not
registered
err:ole:create_server class {29131539-2eed-1069-bf5d-00dd011186b7} not
registered
fixme:ole:CoGetClassObject CLSCTX_REMOTE_SERVER not supported
err:ole:CoGetClassObject no class object {29131539-2eed-1069-bf5d-00dd011186b7}
could be created for context 0x15
--
Configure bugmail: http://bugs.winehq.org/userprefs.cgi?tab=email
Do not reply to this email, post in Bugzilla using the
above URL to reply.
------- You are receiving this mail because: -------
You are watching all bug changes.
http://bugs.winehq.org/show_bug.cgi?id=27974
Summary: warn:winsock:wsaErrno errno 115, (Operation now in
progress).
Product: Wine
Version: 1.3.25
Platform: x86
OS/Version: Linux
Status: UNCONFIRMED
Severity: normal
Priority: P2
Component: winsock
AssignedTo: wine-bugs(a)winehq.org
ReportedBy: roland(a)mxchange.org
The error 115 (Operation now in progress) is, as far as I know, usual with
non-blocking connections and should not raise a warning for those non-blocking
connections. I got this error, e.g. with Steam when it attempts to download
files.
--
Configure bugmail: http://bugs.winehq.org/userprefs.cgi?tab=email
Do not reply to this email, post in Bugzilla using the
above URL to reply.
------- You are receiving this mail because: -------
You are watching all bug changes.
http://bugs.winehq.org/show_bug.cgi?id=36668
Bug ID: 36668
Summary: Under Wine, Installation of Hotspot Shield
Fails/Crashes
Product: Wine
Version: unspecified
Hardware: x86-64
OS: Linux
Status: UNCONFIRMED
Severity: normal
Priority: P2
Component: -unknown
Assignee: wine-bugs(a)winehq.org
Reporter: bugs(a)piouseye.com
Created attachment 48713
--> http://bugs.winehq.org/attachment.cgi?id=48713
Report Generated By Wine @ Failure
Hotspot Shield crashes during installation. This does not SEEM to be the same
issue as in Bug 16002 or other "Possible Duplicates," so I'm passing along the
report Wine generated.
--
Do not reply to this email, post in Bugzilla using the
above URL to reply.
You are receiving this mail because:
You are watching all bug changes.
https://bugs.winehq.org/show_bug.cgi?id=43702
Bug ID: 43702
Summary: No comments shown if no maintainers for app
Product: WineHQ Apps Database
Version: unspecified
Hardware: x86
OS: Linux
Status: UNCONFIRMED
Severity: normal
Priority: P2
Component: appdb-unknown
Assignee: wine-bugs(a)winehq.org
Reporter: azrdev(a)qrdn.de
Distribution: ---
If an app has no maintainers, it shows "comments disabled", and one cannot
enter new comments. This is useful, because no one would moderate them.
However, it would still be useful to see the backlog of old comments, which may
contain hints and workarounds posted by users (when there still were
maintainers).
--
Do not reply to this email, post in Bugzilla using the
above URL to reply.
You are receiving this mail because:
You are watching all bug changes.
http://bugs.winehq.org/show_bug.cgi?id=16214
Summary: Copy command does not work as expected
Product: Wine
Version: 1.0.1
Platform: Other
OS/Version: other
Status: NEW
Severity: enhancement
Priority: P2
Component: dos
AssignedTo: wine-bugs(a)winehq.org
ReportedBy: scott(a)open-vote.org
>From Launchpad: https://bugs.edge.launchpad.net/ubuntu/+source/wine/+bug/272921
In Windows, the COPY command run in a command prompt allows users to
concatenate files by using a plus ("+") operator, for example:
copy file1+file2 outfile
In wine's cmd.exe, it seems to read file1+file2 as a single path and therefore
outputs a "Path Not Found". Also, it does not recognize the "con" keyword used
to represent stdout/stdin. Therefore another method of concatenating files:
copy file1 outfile
copy file2 con >> outfile
does not work either.
My Ubuntu version is 8.04, AMD64 architecture, though I have seen the same
issue on the x86 version as well.
--
Configure bugmail: http://bugs.winehq.org/userprefs.cgi?tab=email
Do not reply to this email, post in Bugzilla using the
above URL to reply.
------- You are receiving this mail because: -------
You are watching all bug changes.
http://bugs.winehq.org/show_bug.cgi?id=33492
Bug #: 33492
Summary: Yukon Trail installer fails to install its font
Product: Wine
Version: 1.5.29
Platform: x86
OS/Version: Linux
Status: NEW
Keywords: Installer, win16
Severity: minor
Priority: P2
Component: -unknown
AssignedTo: wine-bugs(a)winehq.org
ReportedBy: austinenglish(a)gmail.com
Blocks: 10349
Classification: Unclassified
The installer will offer to let you install its custom font (optional, not
required). If you choose to, it then fails, saying:
=========
FATAL ERROR AT SCRIPT LINE 260
Cannot find section header
=========
if you open ~/.wine/drive_c/windows/win.ini, and add:
[fonts]
to the end, the font will install fine
--
Configure bugmail: http://bugs.winehq.org/userprefs.cgi?tab=email
Do not reply to this email, post in Bugzilla using the
above URL to reply.
------- You are receiving this mail because: -------
You are watching all bug changes.
https://bugs.winehq.org/show_bug.cgi?id=43481
Bug ID: 43481
Summary: GeoForms Demo needs "vs_2_a" compilation target
Product: Wine
Version: 2.14
Hardware: x86-64
URL: http://www.nvidia.com/coolstuff/demos#!/geoforms
OS: Linux
Status: NEW
Keywords: download
Severity: minor
Priority: P2
Component: directx-d3dx9
Assignee: wine-bugs(a)winehq.org
Reporter: andrey.goosev(a)gmail.com
Distribution: ---
fixme:d3dcompiler:compile_shader Compilation target "vs_2_a" not yet supported
--
Do not reply to this email, post in Bugzilla using the
above URL to reply.
You are receiving this mail because:
You are watching all bug changes.
http://bugs.winehq.org/show_bug.cgi?id=10349
Summary: Yukon Trail installer crashes at the end
Product: Wine
Version: 0.9.48.
Platform: Other
OS/Version: other
Status: UNCONFIRMED
Severity: minor
Priority: P2
Component: wine-misc
AssignedTo: wine-bugs(a)winehq.org
ReportedBy: echidnaman(a)gmail.com
Created an attachment (id=9017)
--> (http://bugs.winehq.org/attachment.cgi?id=9017)
Crash Log
After the Yukon Trail's installer is done installing, it crashes, taking the
file browser it spawns with it.
To reproduce:
-Run installer
-Complete installation
--
Configure bugmail: http://bugs.winehq.org/userprefs.cgi?tab=email
------- You are receiving this mail because: -------
You are watching all bug changes.
https://bugs.winehq.org/show_bug.cgi?id=46700
Bug ID: 46700
Summary: notepad++ keep non existing file when deleted
Product: Wine
Version: 4.0-rc7
Hardware: x86
OS: Linux
Status: UNCONFIRMED
Severity: normal
Priority: P2
Component: -unknown
Assignee: wine-bugs(a)winehq.org
Reporter: andrej8anubis(a)gmail.com
Distribution: ---
I have notepad++ set so that it silently updates file changes, but if some file
open in notepad++ gets deleted, I get the window in notepad++, asking me "keep
non existing file" on the title bar, and I see no buttons to click. Can someone
check this out pleas? Thank you
--
Do not reply to this email, post in Bugzilla using the
above URL to reply.
You are receiving this mail because:
You are watching all bug changes.
https://bugs.winehq.org/show_bug.cgi?id=42566
Bug ID: 42566
Summary: Edit control uses WM_PAINT instead of WM_ERASEBKGND
Product: Wine
Version: 2.0
Hardware: x86
OS: Linux
Status: UNCONFIRMED
Severity: normal
Priority: P2
Component: user32
Assignee: wine-bugs(a)winehq.org
Reporter: james.tabor(a)reactos.org
Distribution: ---
Created attachment 57478
--> https://bugs.winehq.org/attachment.cgi?id=57478
Test Program
In Windows, the edit control uses the WM_ERASEBKGND message to erase the
background but the Wine edit control uses the WM_PAINT message. Test app
included..
--
Do not reply to this email, post in Bugzilla using the
above URL to reply.
You are receiving this mail because:
You are watching all bug changes.
http://bugs.winehq.org/show_bug.cgi?id=18578
Summary: Wine reverses big/small icon resources in WM_SETICON
Product: Wine
Version: 1.1.21
Platform: PC-x86-64
OS/Version: Linux
Status: UNCONFIRMED
Severity: trivial
Priority: P2
Component: user32
AssignedTo: wine-bugs(a)winehq.org
ReportedBy: emwine(a)earthlink.net
Created an attachment (id=21241)
--> (http://bugs.winehq.org/attachment.cgi?id=21241)
Testcase binary and source (VC 6.0 command line for compiling at end of c file)
This could be two bugs, could be one-- I'm not sure. This occurs both in
WM_SETICON, and also when registering a WNDCLASS structure with
RegisterClassEx().
When calling WM_SETICON, wParam indicates whether or not to use the big or
small resource. (ICON_BIG, or ICON_SMALL). Windows reverses these, Wine
doesn't. Running the testcase:
Windows:
icon, then press 'b': get 16x16 IDI_ICON
icon, then press 's': get scaled 32x32 IDI_ICON
Wine:
wine icon, then press 'b': get scaled 32x32 IDI_ICON
wine icon, then press 's': nothing at all
For Wine, you may have to hit 'b' a few times, even restarting the app before
it works-- I don't know why it's flaky.
I noticed this problem because I had ugly icons in my MFC MDI app in Wine, and
realized it was scaling the 32x32 resource instead of using the 16x16 one.
When writing the app, I noticed that CWnd::SetIcon(HICON, BOOL bBig) reversed
the 2nd parameter in reality. Probably Wine just went by the docs and nobody
noticed the docs are reversed from reality.
The other issue that may in fact be the same bug is that the WNDCLASS
structure's icons are reversed as well. I'm thinking it's the same windows bug
responsible for the reversal with the documentation manifesting itself in
multiple places. So it's entirely possible it's just one issue in Wine also
since Wine doesn't reverse them. Running the testcase again:
Windows:
icon: IDI_APPLICATION used (hIconSm)
icon foo: IDI_QUESTION used (hIconSm)
Wine:
wine icon: IDI_QUESTION used (hIcon)
wine icon foo: IDI_APPLICATION used (hIcon)
There's also a question of what happens when you use hInstance instead of NULL
in the LoadIcon() calls, but this bug isn't dealing with that problem.
--
Configure bugmail: http://bugs.winehq.org/userprefs.cgi?tab=email
Do not reply to this email, post in Bugzilla using the
above URL to reply.
------- You are receiving this mail because: -------
You are watching all bug changes.
https://bugs.winehq.org/show_bug.cgi?id=38566
Bug ID: 38566
Summary: LB_SETSEL message should set caret as well
Product: Wine
Version: unspecified
Hardware: x86
OS: Linux
Status: UNCONFIRMED
Severity: normal
Priority: P2
Component: comctl32
Assignee: wine-bugs(a)winehq.org
Reporter: q.winehq(a)rsn-tech.co.uk
Distribution: ---
When you send the LB_SETSEL message to a multi-selection list box in Windows,
it also sets the focus to the appropriate item and scrolls it into view if
necessary. In Wine, this secondary function appears not to happen and an
additional LB_SETCARETINDEX message is needed to duplicate the full Windows
functionality.
I don't know if this happens in all circumstances, but it fixed a long-standing
problem in a complex application where a list box would not automatically
scroll as it did in Windows.
--
Do not reply to this email, post in Bugzilla using the
above URL to reply.
You are receiving this mail because:
You are watching all bug changes.
http://bugs.winehq.org/show_bug.cgi?id=23816
Summary: Wine fails to find mscorsvw.exe
Product: Wine
Version: 1.2
Platform: x86
OS/Version: Linux
Status: UNCONFIRMED
Severity: normal
Priority: P2
Component: -unknown
AssignedTo: wine-bugs(a)winehq.org
ReportedBy: william.r.douglas+wine(a)gmail.com
CC: madewokherd(a)gmail.com
I am getting the attached error when I attempt to run wine with a executable
requiring .NET 3.5.
I am using wine 1.2 installed through the ubuntu ppa. I am using 64 bit ubuntu
so my lib directory is /usr/lib32/wine though I don't know if that makes much
difference. Also my full path for the v2 .NET folder is:
~/.wine/drive_c/windows/Microsoft.NET/Framework/v2.0.50727
I am attempting to have mono26 installed through winetricks be used in place of
the .NET framework.
--
Configure bugmail: http://bugs.winehq.org/userprefs.cgi?tab=email
Do not reply to this email, post in Bugzilla using the
above URL to reply.
------- You are receiving this mail because: -------
You are watching all bug changes.
https://bugs.winehq.org/show_bug.cgi?id=39867
Bug ID: 39867
Summary: Long path components (e.g. 250 character long) crash
open/save dialogs
Product: Wine
Version: 1.8
Hardware: x86
OS: Linux
Status: UNCONFIRMED
Severity: normal
Priority: P2
Component: comdlg32
Assignee: wine-bugs(a)winehq.org
Reporter: whitequark(a)whitequark.org
Distribution: ---
To reproduce:
1. mkdir
aaaaaaaaaaaaaaaaaaaaaaaaaaaaaaaaaaaaaaaaaaaaaaaaaaaaaaaaaaaaaaaaaaaaaaaaaaaaaaaaaaaaaaaaaaaaaaaaaaaaaaaaaaaaaaaaaaaaaaaaaaaaaaaaaaaaaaaaaaaaaaaaaaaaaaaaaaaaaaaaaaaaaaaaaaaaaaaaaaaaaaaaaaaaaaaaaaaaaaaaaaaaaaaaaaaaaaaaaaaaaaaaaaaaaaaaaaaaaaaaaaaaaaaa
2. call GetOpenFileName and navigate to a directory containing the newly
created one
3. Wine is aborted by stack smashing protection
--
Do not reply to this email, post in Bugzilla using the
above URL to reply.
You are receiving this mail because:
You are watching all bug changes.
https://bugs.winehq.org/show_bug.cgi?id=43245
Bug ID: 43245
Summary: Secret World Legends - Installer fails
Product: Wine
Version: 2.10
Hardware: x86
OS: Linux
Status: UNCONFIRMED
Severity: normal
Priority: P2
Component: -unknown
Assignee: wine-bugs(a)winehq.org
Reporter: maiktapwagner(a)aol.com
Distribution: ---
Created attachment 58553
--> https://bugs.winehq.org/attachment.cgi?id=58553
Console output wine 2.10 (non-staging)
Hello everyone,
Secret World has been released as free to play today and I did a brief test on
wine 2.10. Unfortunately the installation fails and I can submit a crash report
to Funcom. Console output is attached.
--
Do not reply to this email, post in Bugzilla using the
above URL to reply.
You are receiving this mail because:
You are watching all bug changes.
https://bugs.winehq.org/show_bug.cgi?id=39761
Bug ID: 39761
Summary: MDK (MDKDEM95.EXE) graphics not drawn
Product: Wine
Version: 1.8-rc3
Hardware: x86
OS: Mac OS X
Status: NEW
Severity: normal
Priority: P2
Component: -unknown
Assignee: wine-bugs(a)winehq.org
Reporter: jeffz(a)jeffz.name
Tested on OSX 10.9.5.
http://jeffz.name/mdkdemo_repack.tar.bz2
winecfg virtual desktop set to 640x480
cd ~/.wine/drive_c && tar xf ~/mdkdemo_repack.tar.bz2 && cd mdkdemo_repack
wine MDKDEM95.EXE
The game loads (as can be heard by the sounds after hitting enter a few times)
but nothing is ever drawn. There should be intro credits, main menu and
gameplay.
Confirmed that this bug does not happen on Windows 7. It works fine there.
Note: bug #39760 deals with the D3D version of the demo.
--
Do not reply to this email, post in Bugzilla using the
above URL to reply.
You are receiving this mail because:
You are watching all bug changes.
https://bugs.winehq.org/show_bug.cgi?id=47154
Bug ID: 47154
Summary: Rise of the Tomb Raider crashes after 1st bink video
Product: vkd3d
Version: 1.1
Hardware: x86
OS: Linux
Status: UNCONFIRMED
Severity: normal
Priority: P2
Component: vkd3d
Assignee: wine-bugs(a)winehq.org
Reporter: berillions(a)gmail.com
Distribution: ---
Created attachment 64383
--> https://bugs.winehq.org/attachment.cgi?id=64383
Rise of the Tomb Raider d3d12 log
Hello,
I'm on Gentoo + AMD Rx580 + Mesa Git + LLVM git (9.0.0) + Vkd3d Git and i
decided to try the only d3d12 game i have : Rise of the Tomb Raider.
The game runs but crash after the 1st bink video when the main menu must be
appear. The game runs on wined3d/d3d11 but it's unplayable, works (of course
with DXVK) and with the Native version.
I attach the +d3d12 log. Josef, i you need something else to help you, don't
hesitate.
--
Do not reply to this email, post in Bugzilla using the
above URL to reply.
You are receiving this mail because:
You are watching all bug changes.
http://bugs.winehq.org/show_bug.cgi?id=18234
Summary: Approach: Maximizing internalal minimized icon give
"About Wine"
Product: Wine
Version: 1.1.20
Platform: PC
OS/Version: Linux
Status: UNCONFIRMED
Severity: normal
Priority: P3
Component: -unknown
AssignedTo: wine-bugs(a)winehq.org
ReportedBy: ToddAndMargo(a)verizon.net
Created an attachment (id=20742)
--> (http://bugs.winehq.org/attachment.cgi?id=20742)
About wine instead of a maximized window
Hi All,
In Lotus Approach, if you use the internal windows control (the low set of
caption buttons) to minimize a single database, it will appear as an icon in
the lower right of Approach's window. If you double click on the icon to
maximize the window again, you get "About Wine 1.1.20" (and no maximized
window)
Many thanks,
-T
--
Configure bugmail: http://bugs.winehq.org/userprefs.cgi?tab=email
Do not reply to this email, post in Bugzilla using the
above URL to reply.
------- You are receiving this mail because: -------
You are watching all bug changes.
http://bugs.winehq.org/show_bug.cgi?id=18233
Summary: Approach underscore bar inactive with multiple database
open
Product: Wine
Version: 1.1.20
Platform: PC
OS/Version: Linux
Status: UNCONFIRMED
Severity: normal
Priority: P3
Component: -unknown
AssignedTo: wine-bugs(a)winehq.org
ReportedBy: ToddAndMargo(a)verizon.net
Hi All,
In Lotus Approach, when you have two or more databases open and have them
windowed (Windows --> cascaded, right-left, top-bottom) the underscore button
in the window's internal caption buttons, although showing (not grayed out),
does not work.
Many thanks,
-T
--
Configure bugmail: http://bugs.winehq.org/userprefs.cgi?tab=email
Do not reply to this email, post in Bugzilla using the
above URL to reply.
------- You are receiving this mail because: -------
You are watching all bug changes.
https://bugs.winehq.org/show_bug.cgi?id=45432
Bug ID: 45432
Summary: Implement Windows Native Firewall Rules for Lightwave
Software Licensing - netfw_rules
Product: Wine
Version: 3.11
Hardware: x86-64
OS: Linux
Status: UNCONFIRMED
Severity: blocker
Priority: P2
Component: -unknown
Assignee: wine-bugs(a)winehq.org
Reporter: newel.anderson(a)gmail.com
Distribution: ---
Created attachment 61753
--> https://bugs.winehq.org/attachment.cgi?id=61753
Terminal logs installing and launching Lightwave under WIne 3.11 in Linux
Lightwave requires Windows Native Firewall Inbound/Outbound Rules in order to
register/activate one's license.
For reference, please see:
https://forum.winehq.org/viewtopic.php?f=8&t=30847&p=116945#p116945 (I'm
wineink)
Towards the end of the above thread I posted terminal output as well as
screenshots. Disabling Windows Firewall, as well as deleting the
inbound/outbound rules in Windows, deactivates my license. Re-enabling the
rules and Windows Firewall reactivates my license. Since this functionality
doesn't exist in Wine, Wine hasn't to my knowledge implemented Windows Native
Firewall Rules, it's impossible to register/activate my legally purchased
license in Wine.
Thank you for your time and consideration.
***Please note, the above applies only to a FULL license of Lightwave. The
trial, which is node-locked, works as designed. Unfortunately, the FULL license
is not node-locked.
--
Do not reply to this email, post in Bugzilla using the
above URL to reply.
You are receiving this mail because:
You are watching all bug changes.
https://bugs.winehq.org/show_bug.cgi?id=40500
Bug ID: 40500
Summary: Scrap Mechanic : Unable to launch
Product: Wine
Version: 1.9.8
Hardware: x86-64
OS: Linux
Status: UNCONFIRMED
Severity: normal
Priority: P2
Component: -unknown
Assignee: wine-bugs(a)winehq.org
Reporter: arionrina(a)verizon.net
Distribution: ---
Created attachment 54281
--> https://bugs.winehq.org/attachment.cgi?id=54281
Crash log
Scrap Mechanic doesn't open up the first window, then crashes.
--
Do not reply to this email, post in Bugzilla using the
above URL to reply.
You are receiving this mail because:
You are watching all bug changes.
https://bugs.winehq.org/show_bug.cgi?id=49747
Bug ID: 49747
Summary: ICO_ExtractIconExW causes crash on incomplete windows
executable
Product: Wine
Version: 5.0
Hardware: x86
OS: Linux
Status: UNCONFIRMED
Severity: normal
Priority: P2
Component: user32
Assignee: wine-bugs(a)winehq.org
Reporter: andi(a)notmuch.email
Distribution: ---
Created attachment 68049
--> https://bugs.winehq.org/attachment.cgi?id=68049
backtrace of explorer.exe crashing
I have 31% of a binary in a local directory because some installer/patcher
crashed during installation. Whenever I use `winefile` or `wine explorer.exe`
and scroll to that file in the directory wine crashes with the attached
backtrace.
It appears to be related to the ICO handling code within wine that expects more
input but that doesn't exist yet.
Attached is the backtrace of running the patcher for the "Dark Age of Camelot"
freeshard "Phoenix" (https://playphoenix.online) which did cause this issue for
me.
--
Do not reply to this email, post in Bugzilla using the
above URL to reply.
You are receiving this mail because:
You are watching all bug changes.
https://bugs.winehq.org/show_bug.cgi?id=44288
Bug ID: 44288
Summary: Aldi Steuer 2017 - Video doesn't play back
Product: Wine
Version: 3.0-rc3
Hardware: x86
OS: Linux
Status: UNCONFIRMED
Severity: normal
Priority: P2
Component: -unknown
Assignee: wine-bugs(a)winehq.org
Reporter: maiktapwagner(a)aol.com
Distribution: ---
Created attachment 60121
--> https://bugs.winehq.org/attachment.cgi?id=60121
Console output wine 3.0rc3 (non-staging)
Hello everyone,
I recently got accepted as a Super-Maintainer for a German taxation program
called "Steuer" (which is the German word for tax).
I can startup the application okay but unfortunately video playback for the
tutorial doesn't work and results in an empty white screen.
Console output is attached.
--
Do not reply to this email, post in Bugzilla using the
above URL to reply.
You are receiving this mail because:
You are watching all bug changes.
https://bugs.winehq.org/show_bug.cgi?id=50174
Bug ID: 50174
Summary: Microsoft Office 365 login page for activating Office
is blank
Product: Wine
Version: 5.22
Hardware: x86
OS: Linux
Status: UNCONFIRMED
Severity: critical
Priority: P2
Component: -unknown
Assignee: wine-bugs(a)winehq.org
Reporter: estebanium(a)outlook.com
Distribution: ---
Created attachment 68692
--> https://bugs.winehq.org/attachment.cgi?id=68692
Screenshot of the blank login window
I have a Office 365 subscription. I visited https://www.office.com/ After
logging into that page, I am then allowed to download the OfficeInstaller.exe.
Selecting and downloading the installation file beforehand ensures that the
Office installation is bound to the account during installation. The Office
products Excel, PowerPoint etc. are activated accordingly. Within the menus,
however, it is noticeable that you are apparently not logged in after all. The
button Log in appears where the name of the account should actually be. If the
subscription expires, the Office installation notices it. Hints appear that you
should use the subscription (activate it) again. If the subscription was
renewed from the Office.com site, the Office installation will not notice it.
If I open Excel, for example, I now have three options: Login, Buy, Enter key.
If I choose Login, a window opens where I can enter my e-mail address on a
Microsoft page. After entering it I should get to the next menu item where I
can enter my password. But the window there is empty. It is simply white.
--
Do not reply to this email, post in Bugzilla using the
above URL to reply.
You are receiving this mail because:
You are watching all bug changes.
https://bugs.winehq.org/show_bug.cgi?id=44066
Bug ID: 44066
Summary: mintty/msys2 doesn't work since wine 2.5.0 (named
pipes)
Product: Wine-staging
Version: 2.22
Hardware: x86
OS: Linux
Status: UNCONFIRMED
Severity: normal
Priority: P2
Component: -unknown
Assignee: wine-bugs(a)winehq.org
Reporter: andrey.gursky(a)e-mail.ua
CC: erich.e.hoover(a)wine-staging.com, michael(a)fds-team.de,
sebastian(a)fds-team.de
Distribution: ---
Hi!
According to [1], I'm opening a new issue.
msys2 (based on Cygwin up to 2.5.x) does work on wine-staging.
Since 2.5.0 mintty starts but has no visible output. You can work only blindly
(ctrl+d closes the session).
Actually I've expected that since wine 2.5 msys2 will work not only on
wine-staging but also on wine. Unfortunately the opposite has happened.
Regards,
Andrey
[1] https://bugs.winehq.org/show_bug.cgi?id=17195#c189
--
Do not reply to this email, post in Bugzilla using the
above URL to reply.
You are receiving this mail because:
You are watching all bug changes.
http://bugs.winehq.org/show_bug.cgi?id=32334
Bug #: 32334
Summary: Microsoft SQL Server Management Studio Express 2005:
Connection window is too narrow
Product: Wine
Version: 1.5.18
Platform: x86
URL: http://www.microsoft.com/download/en/details.aspx?id=8
961
OS/Version: Linux
Status: UNCONFIRMED
Severity: trivial
Priority: P2
Component: -unknown
AssignedTo: wine-bugs(a)winehq.org
ReportedBy: djelinski1(a)gmail.com
Classification: Unclassified
Regression SHA1: ebaf5ea17623268fb1c0f68b1cf9a5984bd4e46e
Created attachment 42678
--> http://bugs.winehq.org/attachment.cgi?id=42678
Screenshots of good and bad versions
Connection window that appears right after starting the application is too
narrow. You may notice that the bitmap on the top is clipped.
Regression testing points to the following commit:
ebaf5ea17623268fb1c0f68b1cf9a5984bd4e46e is the first bad commit
commit ebaf5ea17623268fb1c0f68b1cf9a5984bd4e46e
Author: Alexandre Julliard <julliard(a)winehq.org>
Date: Thu Nov 15 13:29:21 2012 +0100
gdi32: Don't load bitmap glyphs when using subpixel rendering in
GetGlyphOutline.
Reverting that commit on top of current git brings back correct behavior.
Prerequisite:
winetricks dotnet20 win7
--
Configure bugmail: http://bugs.winehq.org/userprefs.cgi?tab=email
Do not reply to this email, post in Bugzilla using the
above URL to reply.
------- You are receiving this mail because: -------
You are watching all bug changes.
http://bugs.winehq.org/show_bug.cgi?id=21864
Summary: Default paper size A4 instead of my printers default
Product: Wine
Version: 1.1.39
Platform: x86
OS/Version: Linux
Status: UNCONFIRMED
Severity: normal
Priority: P2
Component: -unknown
AssignedTo: wine-bugs(a)winehq.org
ReportedBy: ToddAndMargo(a)verizon.net
Created an attachment (id=26481)
--> (http://bugs.winehq.org/attachment.cgi?id=26481)
cups paper size
Hi All,
Would you guys fix this for me?
Word Pro, Note Pad Plus, all think my default printer is my Okidata B4350. And
it is. But, all new documents default to A4 as the paper size and it is not.
It is "Letter". Wine is not picking up the default paper size from my printer.
Many thanks,
-T
--
Configure bugmail: http://bugs.winehq.org/userprefs.cgi?tab=email
Do not reply to this email, post in Bugzilla using the
above URL to reply.
------- You are receiving this mail because: -------
You are watching all bug changes.
http://bugs.winehq.org/show_bug.cgi?id=32514
Bug #: 32514
Summary: Crash when executing Digit.Exe from Digit Magazine
(India)
Product: Wine
Version: 1.5.17
Platform: x86-64
OS/Version: Linux
Status: UNCONFIRMED
Severity: normal
Priority: P2
Component: -unknown
AssignedTo: wine-bugs(a)winehq.org
ReportedBy: vikigoyal(a)gmail.com
Classification: Unclassified
Created attachment 42892
--> http://bugs.winehq.org/attachment.cgi?id=42892
Screen shot of list of files & folders on the Digit DVD
I run KDE in Fedora 17.
The Wine Packages & version installed at the moment on the system:
wine-wow-1.5.17-1.fc17.x86_64
mingw32-wine-gecko-1.8-1.fc17.noarch
wine-capi-1.5.17-1.fc17.x86_64
wine-fonts-1.5.17-1.fc17.noarch
wine-pulseaudio-1.5.17-1.fc17.i686
q4wine-0.121-3.fc17.x86_64
wine-filesystem-1.5.17-1.fc17.noarch
wine-ldap-1.5.17-1.fc17.i686
wine-alsa-1.5.17-1.fc17.x86_64
wine-mono-0.0.8-1.fc17.noarch
wine-twain-1.5.17-1.fc17.i686
wine-system-fonts-1.5.17-1.fc17.noarch
wine-systemd-1.5.17-1.fc17.noarch
wine-core-1.5.17-1.fc17.x86_64
wine-cms-1.5.17-1.fc17.x86_64
wine-core-1.5.17-1.fc17.i686
wine-1.5.17-1.fc17.x86_64
wine-debuginfo-1.5.17-1.fc17.x86_64
wine-tahoma-fonts-1.5.17-1.fc17.noarch
wine-ldap-1.5.17-1.fc17.x86_64
wine-desktop-1.5.17-1.fc17.noarch
wine-symbol-fonts-1.5.17-1.fc17.noarch
wine-pulseaudio-1.5.17-1.fc17.x86_64
wine-cms-1.5.17-1.fc17.i686
wine-small-fonts-1.5.17-1.fc17.noarch
wine-openal-1.5.17-1.fc17.i686
wine-docs-1.4-1.fc17.noarch
wine-common-1.5.17-1.fc17.noarch
wine-marlett-fonts-1.5.17-1.fc17.noarch
wine-capi-1.5.17-1.fc17.i686
wine-ms-sans-serif-fonts-1.5.17-1.fc17.noarch
wine-tahoma-fonts-system-1.5.17-1.fc17.noarch
wine-twain-1.5.17-1.fc17.x86_64
wine-courier-fonts-1.5.17-1.fc17.noarch
wine-openal-1.5.17-1.fc17.x86_64
mingw64-wine-gecko-1.8-1.fc17.noarch
I want to use a DVD supplied by a computer magazine called Digit in India
on my system just as it can be used on Windows.
For that I right clicked Digit.exe & selected 'Open With Wine' in Dolphin.
There was a crash. I want to supply the crash dump. I hope that dump proves
useful & changes be brought in Wine so that the DVD can run on Linux in Wine.
Thanks...
--
Configure bugmail: http://bugs.winehq.org/userprefs.cgi?tab=email
Do not reply to this email, post in Bugzilla using the
above URL to reply.
------- You are receiving this mail because: -------
You are watching all bug changes.
https://bugs.winehq.org/show_bug.cgi?id=38519
Bug ID: 38519
Summary: Some letters are cut in winecfg
Product: Wine
Version: 1.7.38
Hardware: x86-64
OS: Linux
Status: UNCONFIRMED
Severity: normal
Priority: P2
Component: -unknown
Assignee: wine-bugs(a)winehq.org
Reporter: sworddragon2(a)aol.com
Distribution: ---
In the register "Drives" the columns "Letter" and "Target folder" are cutting
the last letter and in the register "Applications" the entry "Default Settings"
does cut the last letter too in the german translation if this register is
reentered.
--
Do not reply to this email, post in Bugzilla using the
above URL to reply.
You are receiving this mail because:
You are watching all bug changes.
http://bugs.winehq.org/show_bug.cgi?id=37084
Bug ID: 37084
Summary: An error occurred during the closing Wayward.exe
Product: Wine
Version: 1.7.22
Hardware: x86-64
OS: Linux
Status: UNCONFIRMED
Severity: normal
Priority: P2
Component: ntdll
Assignee: wine-bugs(a)winehq.org
Reporter: stalkerandrei2010(a)mail.ru
Created attachment 49287
--> http://bugs.winehq.org/attachment.cgi?id=49287
Bug appeared when the application is closed
The application itself has not earned
--
Do not reply to this email, post in Bugzilla using the
above URL to reply.
You are receiving this mail because:
You are watching all bug changes.
https://bugs.winehq.org/show_bug.cgi?id=48787
Bug ID: 48787
Summary: WineD3D C&C Generals Zero Hour takes a lot time to
load or maximize
Product: vkd3d
Version: 1.1
Hardware: x86-64
OS: Windows
Status: UNCONFIRMED
Severity: normal
Priority: P2
Component: vkd3d
Assignee: wine-bugs(a)winehq.org
Reporter: moceap(a)hotmail.com
As you know (C&C Generals Zero Hour) is an old game. And it use DirectX 8.1.
These type of games don't stable in current Windows' versions.
So WineD3D used to valid run them on Windows.
Using: C&C Generals Zero Hour (Last Version 1.04)
Windows 10 (1909)
WineD3D (From Wine 5.4)https://fdossena.com/?p=wined3d/index.frag
Both (Intel and AMD) cards tested
Expected Result: Works fine with high speed.
Actual Result: Very long time on maximize the game after minimize or switch to
another application
Long time on loading the game (Not happen on MS DirectX)
--
Do not reply to this email, post in Bugzilla using the
above URL to reply.
You are receiving this mail because:
You are watching all bug changes.
https://bugs.winehq.org/show_bug.cgi?id=44966
Bug ID: 44966
Summary: [ER: The Game] A style error occurred while verifying
the reading of the license agreement.
Product: WineHQ Apps Database
Version: unspecified
Hardware: x86-64
OS: Linux
Status: UNCONFIRMED
Severity: major
Priority: P2
Component: appdb-unknown
Assignee: wine-bugs(a)winehq.org
Reporter: ilya(a)ilin.pp.ua
Distribution: ---
Created attachment 61088
--> https://bugs.winehq.org/attachment.cgi?id=61088
Screenshot
When installing the game, the possibility of accepting the license agreement is
conceived only if it is fully read (textarea should scroll to the bottom).
But in wine it does not work.
wine 3.5 openSUSE Tumbleweed
Game download: (registry don't need)
https://firedrop.com/4bfe735821e6bfcb or
http://www.theisozone.com/downloads/pc/windows-games/er---the-game (Black
Download button)
Patches: https://www.gamewatcher.com/games/er/downloads
0030:err:ole:TLB_ReadTypeLib Loading of typelib L"C:\\Program Files
(x86)\\Common Files\\InstallShield\\Professional\\RunTime\\IsProBE.tlb" failed
with error 2
0030:fixme:ntdll:NtLockFile I/O completion on lock not implemented yet
0030:fixme:apphelp:ApphelpCheckInstallShieldPackage stub: 0x33dd3c
L"M:\\data1.hdr"
0030:err:richedit:ReadStyleSheet skipping optional destination
0030:err:richedit:ReadStyleSheet skipping optional destination
0030:err:richedit:ReadStyleSheet skipping optional destination
--
Do not reply to this email, post in Bugzilla using the
above URL to reply.
You are receiving this mail because:
You are watching all bug changes.
https://bugs.winehq.org/show_bug.cgi?id=38774
Bug ID: 38774
Summary: Execute MS Excel 2007 macro crashes Excel
Product: Wine
Version: 1.6.2
Hardware: x86
OS: Linux
Status: UNCONFIRMED
Severity: major
Priority: P2
Component: -unknown
Assignee: wine-bugs(a)winehq.org
Reporter: florent.merlet(a)free.fr
Distribution: ---
Created attachment 51706
--> https://bugs.winehq.org/attachment.cgi?id=51706
Crash report of macro execution on Microsoft Excel 2007
The execution of a Excel Visual Basic Macro execution does not work when it is
compiled from Wine 1.6.2.
The compilation starts properly, and the window freezes after few seconds.
The macro tested works properly on windows 7.
There is no problem to modify, record the macro, and execute it from a MS
Windows 7 environment.
details :
Microsoft EXCEL 2007, installed
Windows 7 personal
--
Do not reply to this email, post in Bugzilla using the
above URL to reply.
You are receiving this mail because:
You are watching all bug changes.
https://bugs.winehq.org/show_bug.cgi?id=46254
Bug ID: 46254
Summary: EnumResourceTypesW should return True if there are no
resources to enumerate
Product: Wine
Version: 3.17
Hardware: x86
OS: Linux
Status: UNCONFIRMED
Severity: normal
Priority: P2
Component: kernel32
Assignee: wine-bugs(a)winehq.org
Reporter: stu.axon(a)gmail.com
Distribution: ---
EnumResourceTypesW -- When there are no resource types to enumerate the
function instead of True will return False (see
https://github.com/wine-mirror/wine/blob/master/dlls/kernel32/resource.c#L2…)
This bug was originally reported in pywin32-ctypes
https://github.com/enthought/pywin32-ctypes/issues/59
--
Do not reply to this email, post in Bugzilla using the
above URL to reply.
You are receiving this mail because:
You are watching all bug changes.
https://bugs.winehq.org/show_bug.cgi?id=39590
Bug ID: 39590
Summary: SAS 9.1.3 Portable not working - "No access to memory
location"
Product: Wine
Version: 1.7.55
Hardware: x86
OS: Linux
Status: UNCONFIRMED
Severity: normal
Priority: P2
Component: -unknown
Assignee: wine-bugs(a)winehq.org
Reporter: n296869(a)rtrtr.com
Distribution: ---
Created attachment 52755
--> https://bugs.winehq.org/attachment.cgi?id=52755
LC_ALL=C WINEDEBUG=warn+all wine sas_9.1.3_portable.exe
Hello, we have to use SAS on my university, all students have license to use it
on personal computers, but it's distributed on like 10 CDs and it's horrible
pain to download and install properly even on Windows. I use Linux, so i want
to run it in wine. There are people that managed installing some versions of
SAS in wine, but i think it's not worth the effort even on windows.
Some great guy therefore made SAS Portable, which is (possibly illegal)
compilation of SAS directly executable as single exe file. You can download it
here http://uloz.to/xtKasDE/sas-9-1-3-portable-exe (if it's legal in your
country as it is in mine).
Can you please check why it does not work in wine? It works great on windows.
In wine it just shows popup saying "No access to memory location." and prints
following errors to terminal (see attachments for the same with wine debugging
enabled:
err:winediag:SECUR32_initNTLMSP ntlm_auth was not found or is outdated. Make
sure that ntlm_auth >= 3.0.25 is in your path. Usually, you can find it in the
winbind package of your distribution.
fixme:ntdll:NtRaiseHardError : stub. Errorstatus was c0000135
fixme:advapi:RegisterEventSourceA ((null),"SASEXE"): stub
fixme:advapi:RegisterEventSourceW (L"",L"SASEXE"): stub
fixme:advapi:ReportEventA
(0xcafe4242,0x0001,0x0000,0xc0000bb8,0x1633b8,0x0003,0x00000000,0x32e618,(nil)):
stub
fixme:advapi:ReportEventW
(0xcafe4242,0x0001,0x0000,0xc0000bb8,0x1633b8,0x0003,0x00000000,0x15fcc8,(nil)):
stub
err:eventlog:ReportEventW L"Unable to load host supervisor."
err:eventlog:ReportEventW L"C:\\Program Files\\SAS\\SAS 9.1\\sashost.dll"
err:eventlog:ReportEventW L"No access to memory location.\r\n"
fixme:advapi:DeregisterEventSource (0xcafe4242) stub
--
Do not reply to this email, post in Bugzilla using the
above URL to reply.
You are receiving this mail because:
You are watching all bug changes.
http://bugs.winehq.org/show_bug.cgi?id=24846
Summary: SecureCRT: Pop-up menu list flashes
Product: Wine
Version: 1.3.5
Platform: x86
OS/Version: Linux
Status: UNCONFIRMED
Severity: trivial
Priority: P2
Component: -unknown
AssignedTo: wine-bugs(a)winehq.org
ReportedBy: lukasz.wojnilowicz(a)gmail.com
Created an attachment (id=31435)
--> (http://bugs.winehq.org/attachment.cgi?id=31435)
Image showing the problem
Steps to reproduce:
1) remove ~/.wine
2) winetricks gecko
2) install SecureCRT
3) wine SecureCRT.exe
4) unfold pop-up menu as shown in attachment
Behaviour:
Pop-up menu list flashes.
Expected behaviour:
Pop-up menu list shouldn't flash.
--
Configure bugmail: http://bugs.winehq.org/userprefs.cgi?tab=email
Do not reply to this email, post in Bugzilla using the
above URL to reply.
------- You are receiving this mail because: -------
You are watching all bug changes.
http://bugs.winehq.org/show_bug.cgi?id=26503
Summary: modal windows don't stay on top
Product: Wine
Version: 1.3.15
Platform: x86
OS/Version: Linux
Status: UNCONFIRMED
Severity: normal
Priority: P2
Component: -unknown
AssignedTo: wine-bugs(a)winehq.org
ReportedBy: c_pradelli(a)yahoo.com
Created an attachment (id=33743)
--> (http://bugs.winehq.org/attachment.cgi?id=33743)
Simple delphi program + source.
Under MS Windows these modal windows can be placed anywhere on the screen,
clicking the main window doesn't hide them. Not so under Wine: clicking the
main window puts it on top hiding the modal windows.
Ubuntu 10.04
Wine version 1.3.15
Demo from Khmelevskiy Alexandr is attached.
Open "bug21039.exe" then press "MessageBox" button.
Press main windows.
Messagebox goes behind main window an application hangup.
--
Configure bugmail: http://bugs.winehq.org/userprefs.cgi?tab=email
Do not reply to this email, post in Bugzilla using the
above URL to reply.
------- You are receiving this mail because: -------
You are watching all bug changes.
http://bugs.winehq.org/show_bug.cgi?id=34516
Bug #: 34516
Summary: Terragen fails to start
Product: Wine
Version: 1.7.2
Platform: x86
OS/Version: Linux
Status: UNCONFIRMED
Severity: normal
Priority: P2
Component: -unknown
AssignedTo: wine-bugs(a)winehq.org
ReportedBy: lukasz.wojnilowicz(a)gmail.com
Classification: Unclassified
Created attachment 45946
--> http://bugs.winehq.org/attachment.cgi?id=45946
Terminal output on Wine 1.7.2
Steps to reproduce:
1) remove ~/.wine
2) install Terragen
3) wine tgd.exe
4) click "Use free version"
Behaviour:
Wine error.
Expected behaviour:
No Wine error.
--
Configure bugmail: http://bugs.winehq.org/userprefs.cgi?tab=email
Do not reply to this email, post in Bugzilla using the
above URL to reply.
------- You are receiving this mail because: -------
You are watching all bug changes.
http://bugs.winehq.org/show_bug.cgi?id=32342
Bug #: 32342
Summary: PlanetSide2 Error message and bugreport.txt and
debug.log in Steam.
Product: Wine
Version: unspecified
Platform: x86
OS/Version: Linux
Status: UNCONFIRMED
Severity: normal
Priority: P2
Component: -unknown
AssignedTo: wine-bugs(a)winehq.org
ReportedBy: linards.liepins(a)gmail.com
Classification: Unclassified
Created attachment 42683
--> http://bugs.winehq.org/attachment.cgi?id=42683
PlanetSide2 bugreport.txt
Cannot run PlanetSide 2 on x64 Fedora 17. Popuing up three similar error log
message with attached bugreport. Also attached debug.log is generated in Steam
install dir.
--
Configure bugmail: http://bugs.winehq.org/userprefs.cgi?tab=email
Do not reply to this email, post in Bugzilla using the
above URL to reply.
------- You are receiving this mail because: -------
You are watching all bug changes.
http://bugs.winehq.org/show_bug.cgi?id=32715
Bug #: 32715
Summary: Running of Linux Live USB causes kernel32 to blow up
Product: Wine
Version: unspecified
Platform: x86
OS/Version: Linux
Status: UNCONFIRMED
Severity: normal
Priority: P2
Component: kernel32
AssignedTo: wine-bugs(a)winehq.org
ReportedBy: raj(a)upadhyaya.com
Classification: Unclassified
Created attachment 43167
--> http://bugs.winehq.org/attachment.cgi?id=43167
Backtrace of blow up
I began testing Linux Live USB creator on Linux. I am running
wine version wine-1.5.18 installed via YUM on Fedora 18, using
the linux kernel 3.8.0-rc3 compiled from source from www.kernel.org.
What Linux Live USB does, is it creates a Live USB Linux USB thumb drive from
an ISO. I keep a Windows XP partition around to run this program. My hope is
to use Wine to run this program and create Linux thumb drives.
Live Linux USB should task Wine, as it looks for new updates and other
information from its web site.
Back Trace attached...
--
Configure bugmail: http://bugs.winehq.org/userprefs.cgi?tab=email
Do not reply to this email, post in Bugzilla using the
above URL to reply.
------- You are receiving this mail because: -------
You are watching all bug changes.
https://bugs.winehq.org/show_bug.cgi?id=46255
Bug ID: 46255
Summary: BeginUpdateResourceW should set errno on invalid
filename
Product: Wine
Version: 3.17
Hardware: x86
OS: Linux
Status: UNCONFIRMED
Severity: normal
Priority: P2
Component: kernel32
Assignee: wine-bugs(a)winehq.org
Reporter: stu.axon(a)gmail.com
Distribution: ---
BeginUpdateResourceW -- will return a Null handle if the filename is invalid
but will not set a proper errorno
(https://github.com/wine-mirror/wine/blob/master/dlls/kernel32/resource.c#L1…
This bug was originally reported to pywin32-ctypes
https://github.com/enthought/pywin32-ctypes/issues/59
--
Do not reply to this email, post in Bugzilla using the
above URL to reply.
You are receiving this mail because:
You are watching all bug changes.
https://bugs.winehq.org/show_bug.cgi?id=46886
Bug ID: 46886
Summary: App Crashes
Product: Wine
Version: unspecified
Hardware: x86-64
OS: Linux
Status: UNCONFIRMED
Severity: normal
Priority: P2
Component: -unknown
Assignee: wine-bugs(a)winehq.org
Reporter: lorkilutra(a)desoz.com
Distribution: ---
Created attachment 63962
--> https://bugs.winehq.org/attachment.cgi?id=63962
Crash
Crashing
--
Do not reply to this email, post in Bugzilla using the
above URL to reply.
You are receiving this mail because:
You are watching all bug changes.
http://bugs.winehq.org/show_bug.cgi?id=22389
Summary: Text fields in dialog box remain highlighted in IDA
Pro (maybe other Borland VCL programs?)
Product: Wine
Version: 1.1.42
Platform: x86
URL: http://www.hex-rays.com/idapro/idadownfreeware.htm
OS/Version: Linux
Status: UNCONFIRMED
Severity: trivial
Priority: P2
Component: -unknown
AssignedTo: wine-bugs(a)winehq.org
ReportedBy: markk(a)clara.co.uk
IDA Pro is an interactive disassembler. A freeware version can be downloaded
from http://www.hex-rays.com/idapro/idadownfreeware.htm
In some dialog boxes, when you press Tab to cycle to the next text box, text in
the previously-active box remains highlighted. It should not.
To demonstrate, download and install the freeware IDA Pro. Load any Windows
executable into it. Click to position the cursor over any label (e.g. start),
and press N to bring up the Rename address dialog box.
Initially, the Name field is highlighted. Press Tab. The "Maximum length of new
names" field is highlighted, but the Name field remains highlighted. Pressing
Tab again causes the "Local name prefix" field to also be highlighted, with the
previous two fields staying highlighted.
Apparently IDA Pro is built using the Borland VCL (Visual Component Library),
so perhaps this issue could affect other programs too.
--
Configure bugmail: http://bugs.winehq.org/userprefs.cgi?tab=email
Do not reply to this email, post in Bugzilla using the
above URL to reply.
------- You are receiving this mail because: -------
You are watching all bug changes.
http://bugs.winehq.org/show_bug.cgi?id=30581
Bug #: 30581
Summary: Dialog windows can get hidden by the main window in
IDA Free 5.0
Product: Wine
Version: 1.5.3
Platform: x86
URL: http://www.hex-rays.com/products/ida/support/download_
freeware.shtml
OS/Version: Linux
Status: UNCONFIRMED
Severity: minor
Priority: P2
Component: -unknown
AssignedTo: wine-bugs(a)winehq.org
ReportedBy: markk(a)clara.co.uk
Classification: Unclassified
IDA Pro is an interactive disassembler. A freeware version of IDA 5.0 can be
downloaded from
http://www.hex-rays.com/products/ida/support/download_freeware.shtml
I tested IDA Free with Wine 1.5.3 under Lubuntu 11.10, which uses the Openbox
window manager.
When "Allow the window manager to control the windows" is enabled in winecfg,
dialog boxes can get hidden behind the main window. The dialogs are modal, so
the main window doesn't accept any input while a dialog is open. If you
accidentally click in the main window while a dialog is open, the dialog
disappears but the main window does not accept any input.
To reproduce:
- Use winecfg to disable virtual desktop mode and enable "Allow the window
manager to control the windows" if necessary; those are the default settings.
- Download and run the IDA Free 5.0 installer.
- Run the program. Click OK at the About dialog and Go in the Welcome to IDA!
window.
- The maximised main window opens. Bring up a dialog box, e.g. by selecting
Help-> About program... or File -> Open...
- When the dialog opens, click in the main window. The dialog window disappears
behind the main window. (You can reveal it by un-maximising the main window and
moving it out of the way.)
For what it's worth, this problem doesn't happen with the IDA Pro 6.2 demo, but
that uses different GUI code (QT?).
--
Configure bugmail: http://bugs.winehq.org/userprefs.cgi?tab=email
Do not reply to this email, post in Bugzilla using the
above URL to reply.
------- You are receiving this mail because: -------
You are watching all bug changes.
http://bugs.winehq.org/show_bug.cgi?id=22522
Summary: black intro videos with smackw32.dll
Product: Wine
Version: 0.9.48.
Platform: x86
OS/Version: Linux
Status: UNCONFIRMED
Severity: trivial
Priority: P2
Component: -unknown
AssignedTo: wine-bugs(a)winehq.org
ReportedBy: hoehle(a)users.sourceforge.net
"Der Dieb von Burg Schreckenstein" and "5 Freunde 2 und der silberne
Turm" start with a black screen when it should show an intro video.
Audio is played normally and the app proceeds to the main menu after
the video ends. Also, pressing a key aborts the video as expected.
The video is visible on a native XP machine.
Both apps use smackw32.dll to display the video. I suppose the screen
remains black because an exception is caught soon after start.
0009:CALL smackw32._SmackDoFrame@4(008c5440) ret=0049ef3d
0009:Call winmm.timeGetTime() [a few times]
0009:Ret winmm.timeGetTime()
0009:trace:seh:raise_exception code=c0000005 flags=0 (access violation)
...
0009:RET smackw32._SmackDoFrame@4() retval=00000000 ret=0049ef3d
The sequence of smackw32 calls is:
smackw32._SmackOpen@12
smackw32._SmackCheckCursor@20
smackw32._SmackToBuffer@28
smackw32._SmackDoFrame@4
The affected video is "intro.smk". Curiously, this is the second such
sequence. The first one, opening "loads.smk" produces no exception
(but it is too short to be a video). Surprisingly, Burg
Schreckenstein's ending credits extro_[1-7].smk are rendered (these
appear to be still images without animation).
Logs are available upon request. What channels?
You may add
[Smacker]
Debug=1
to win.ini and set WINEDEBUG=+debugstr.
I've not yet written an AppDB entry for either of these 2 children apps.
"5 Freunde" is Enid Blyton's "Famous 5" or "Club des cinq".
Bug present with both Ubuntu Intrepid and MacOS, on different HW and was
observed as early as wine-0.9.48 to present.
--
Configure bugmail: http://bugs.winehq.org/userprefs.cgi?tab=email
Do not reply to this email, post in Bugzilla using the
above URL to reply.
------- You are receiving this mail because: -------
You are watching all bug changes.
http://bugs.winehq.org/show_bug.cgi?id=30579
Bug #: 30579
Summary: Main window does not regain focus after dialog closes
in IDA Free 5.0
Product: Wine
Version: 1.5.3
Platform: x86
URL: http://www.hex-rays.com/products/ida/support/download_
freeware.shtml
OS/Version: Linux
Status: UNCONFIRMED
Severity: minor
Priority: P2
Component: -unknown
AssignedTo: wine-bugs(a)winehq.org
ReportedBy: markk(a)clara.co.uk
Classification: Unclassified
IDA Pro is an interactive disassembler. A freeware version of IDA 5.0 can be
downloaded from
http://www.hex-rays.com/products/ida/support/download_freeware.shtml
I tested IDA Free with Wine 1.5.3 under Lubuntu 11.10 (which uses Openbox for
its window manager). This problem only seems to occur when Wine is *not* in
virtual desktop mode.
When viewing a disassembly, if you bring up a dialog box, when the dialog
closes the disassembly does not regain focus. So if you e.g. name a routine,
you then need to click to focus the disassembly before being able to use the
cursor up/down or page up/down keys to move the view.
To reproduce:
- Use winecfg to disable virtual desktop mode if necessary.
- Download and run the IDA Free 5.0 installer.
- Run the program.
- Click New in the Welcome to IDA! window.
- Select PE Executable and click OK.
- Choose a file to open: wingraph32.exe (which comes with the demo)
- Click Next, Next and Finish in the PE Executable file loading Wizard.
- The disassembly view shows the WinMain routine.
- The disassembly has focus, so you can use the cursor keys and PgUp/PgDn to
move in it.
- Move the cursor, either with keyboard or by clicking the mouse, over a
referenced location (e.g. unk_4CC100 or unk_4BE65C).
- Press N to open the Rename address dialog.
- Type something for the name, e.g. blahblahblah and press return.
- The disassembly does not regain focus, so pressing cursor keys to move has no
effect. You need to click in the disassembly so it regains focus.
--
Configure bugmail: http://bugs.winehq.org/userprefs.cgi?tab=email
Do not reply to this email, post in Bugzilla using the
above URL to reply.
------- You are receiving this mail because: -------
You are watching all bug changes.
http://bugs.winehq.org/show_bug.cgi?id=16183
Summary: Popup text is immediately overwritten by background in
IDA Pro
Product: Wine
Version: 1.1.9
Platform: PC
OS/Version: Linux
Status: UNCONFIRMED
Severity: minor
Priority: P2
Component: -unknown
AssignedTo: wine-bugs(a)winehq.org
ReportedBy: markk(a)clara.co.uk
IDA Pro is an interactive disassembler. A freeware version can be downloaded
from http://www.hex-rays.com/idapro/idadownfreeware.htm
When viewing a disassembly, if you hover the mouse pointer over a reference to
another location, a view of the instructions at that location pops up next to
the mouse pointer. You can increase and decrease its height by moving the mouse
wheel.
In Wine this does not work properly. The pop-up display is blank (just the
background colour). Moving the mouse wheel, you can see the text that should be
there, but it is immediately overwritten by the background colour.
To reproduce: download and install IDA Pro freeware version. Run the program
and open a Windows executable. Move the pointer over a reference to another
location in the program and wait for the pop-up display. Notice it is blank.
Move the mouse wheel and (hopefully) see the text being rendered but
immediately overwritten.
--
Configure bugmail: http://bugs.winehq.org/userprefs.cgi?tab=email
Do not reply to this email, post in Bugzilla using the
above URL to reply.
------- You are receiving this mail because: -------
You are watching all bug changes.
https://bugs.winehq.org/show_bug.cgi?id=46963
Bug ID: 46963
Summary: Simcity2000SE Origin crashes
Product: Wine
Version: 4.5
Hardware: x86
OS: Linux
Status: UNCONFIRMED
Severity: normal
Priority: P2
Component: -unknown
Assignee: wine-bugs(a)winehq.org
Reporter: winetest(a)luukku.com
Distribution: ---
Created attachment 64114
--> https://bugs.winehq.org/attachment.cgi?id=64114
wine-staging 4.5
This is one of the free games Origin has given away. I was curious of the
working status of origin with wine so I decided to install it. I currently have
only wine-staging 4.5 installed.
Installing origin, login, downloading game - all went fine, but when I tried
to play the game wine crashes. I don't know if it is related to synging game
data into cloud or starting the game itself.
--
Do not reply to this email, post in Bugzilla using the
above URL to reply.
You are receiving this mail because:
You are watching all bug changes.
https://bugs.winehq.org/show_bug.cgi?id=39762
Bug ID: 39762
Summary: wine iexplore cyscape.com/showbrow.asp does not load
Product: Wine
Version: 1.7.55
Hardware: x86
OS: Linux
Status: UNCONFIRMED
Severity: normal
Priority: P2
Component: -unknown
Assignee: wine-bugs(a)winehq.org
Reporter: the.ideals(a)gmail.com
Distribution: ---
Created attachment 53042
--> https://bugs.winehq.org/attachment.cgi?id=53042
run log
wine iexplore cyscape.com/showbrow.asp
iexplore doesn't go further than notifying the below.
"Performing an extensive browser test. Please wait... "
--
Do not reply to this email, post in Bugzilla using the
above URL to reply.
You are receiving this mail because:
You are watching all bug changes.
https://bugs.winehq.org/show_bug.cgi?id=40835
Bug ID: 40835
Summary: PulseAudio support with NetBSD
Product: Wine
Version: 1.9.12
Hardware: x86
OS: NetBSD
Status: UNCONFIRMED
Severity: minor
Priority: P2
Component: winepulse.drv
Assignee: wine-bugs(a)winehq.org
Reporter: adrien_fernandes2(a)hotmail.com
Created attachment 54798
--> https://bugs.winehq.org/attachment.cgi?id=54798
Output of the compilation
Hello,
I am making a package from scratch for NetBSD using pkgsrc so my objective is
to make it fully functional whatever the user wants to use (thanks to options).
Everything is perfect EXCEPT for a problem when building with PulseAudio
support.
NetBSD 7.0.1 (GENERIC.201605221355Z) i386
--
Do not reply to this email, post in Bugzilla using the
above URL to reply.
You are receiving this mail because:
You are watching all bug changes.
http://bugs.winehq.org/show_bug.cgi?id=30583
Bug #: 30583
Summary: keyboard input does not work after focus-out and
focus-in
Product: Wine
Version: unspecified
Platform: x86-64
OS/Version: Linux
Status: UNCONFIRMED
Severity: normal
Priority: P2
Component: -unknown
AssignedTo: wine-bugs(a)winehq.org
ReportedBy: hramrach(a)gmail.com
Classification: Unclassified
Since upgrade to wine 1.4-rc6 keyboard input does not work after focus is lost
and restored.
0) switch to focus-follows-mouse
1) run notepad
2) enter some text
3) point to another window and back to notepad
4) type
no text appears.
--
Configure bugmail: http://bugs.winehq.org/userprefs.cgi?tab=email
Do not reply to this email, post in Bugzilla using the
above URL to reply.
------- You are receiving this mail because: -------
You are watching all bug changes.
https://bugs.winehq.org/show_bug.cgi?id=37896
Bug ID: 37896
Summary: EM_SETPASSWORDCHAR ineffective when edit control does
not have WS_BORDER set
Product: Wine
Version: 1.7.33
Hardware: x86
OS: Linux
Status: UNCONFIRMED
Severity: major
Priority: P2
Component: user32
Assignee: wine-bugs(a)winehq.org
Reporter: winehq-bugzilla(a)richardpayne.name
Distribution: ---
I have two identical edit controls with ES_PASSWORD set via EM_SETPASSWORDCHAR.
Identical, that is, apart from 1 having WS_BORDER set and the other not.
The one without WS_BORDER does not conceal its contents as it should when a
password char is specified. The one with WS_BORDER set works as expected.
--
Do not reply to this email, post in Bugzilla using the
above URL to reply.
You are receiving this mail because:
You are watching all bug changes.
https://bugs.winehq.org/show_bug.cgi?id=38786
Bug ID: 38786
Summary: An EXE that only creates a WS_EX_TOOLWINDOW window
isn't given focus (or returned focus).
Product: Wine
Version: 1.7.38
Hardware: x86-64
OS: Linux
Status: UNCONFIRMED
Severity: major
Priority: P2
Component: -unknown
Assignee: wine-bugs(a)winehq.org
Reporter: jasonwinter(a)hotmail.com
Distribution: ---
It seems only WS_EX_APPWINDOW windows are given focus by Wine on application
startup (I.E. windows that have a taskbar button).
Windows that do not appear in the taskbar are not given focus by Wine when an
application is started. Additionally, if the user gives focus to that window
using the mouse, things like MessageBox (I.E. another window that takes focus)
do not return focus to a tool-window that last had focus. Instead, focus is
only returned to the last window which had focus and also has a taskbar button.
--
Do not reply to this email, post in Bugzilla using the
above URL to reply.
You are receiving this mail because:
You are watching all bug changes.
https://bugs.winehq.org/show_bug.cgi?id=40255
Bug ID: 40255
Summary: Cannot delete or modify 1Password items
Product: Wine
Version: 1.9.4
Hardware: x86
OS: Linux
Status: UNCONFIRMED
Severity: normal
Priority: P2
Component: -unknown
Assignee: wine-bugs(a)winehq.org
Reporter: jhessin(a)gmail.com
Distribution: ---
While using 1Password ver. 4.6.0.604 I am unable to delete or modify any
passwords in my shared vault. The vault works perfectly fine on my windows
computer. This is the error report generated by the application: NOTE: personal
information has been removed.
Application:
> -------------------------------------------------------
> 1.1 Start Date : Sat, 5 Mar 2016 09:11:42 -0700
> 1.2 Name/Description: 1Password.exe - (1Password)
> 1.3 Version Number : 4.6.0.604
> 1.4 Parameters :
> 1.5 Compilation Date: Tue, 23 Feb 2016 13:07:31 -0700
> 1.6 Up Time : 1 minute, 5 seconds
>
> Exception:
> --------------------------------------------------------------------------
> ------------------------------------- 2.1 Date : Sat, 5 Mar
> 2016 09:12:48 -0700 2.2 Address : 005F3654
> 2.3 Module Name : 1Password.exe - (1Password)
> 2.4 Module Version: 4.6.0.604
> 2.5 Type : EAccessViolation
> 2.6 Message : Access violation at address 005F3654 in module
> '1Password.exe'. Read of address 00000004.
> 2.7 ID : 1001
> 2.8 Count : 1
> 2.9 Status : New
> 2.10 Note :
>
> Active Controls:
> ----------------------------------------------
> 4.1 Form Class : TFrm1pMain
> 4.2 Form Text : 1Password
> 4.3 Control Class: TTntListView.UnicodeClass
> 4.4 Control Text :
>
> Computer:
> -------------------------------------------------------
> 5.1 Name : #########
> 5.2 Total Memory : 3097 Mb
> 5.3 Free Memory : 1739 Mb
> 5.4 Total Disk : 913.32 Gb
> 5.5 Free Disk : 821.71 Gb
> 5.6 System Up Time: 2 hours, 1 minute, 38 seconds
> 5.7 Processor : Intel(R) Pentium(R) 4 CPU 2.40GHz
> 5.8 Display Mode : 1366 x 768, 32 bit
> 5.9 Display DPI : 96
> 5.10 Video Card : X11 Windowing System (driver )
> 5.11 Printer :
>
> Operating System:
> ---------------------------------------------
> 6.1 Type : Microsoft Windows XP (64 bit)
> 6.2 Build # : 3790
> 6.3 Update : Service Pack 2
> 6.4 Language: English
> 6.5 Charset : 0
>
--
Do not reply to this email, post in Bugzilla using the
above URL to reply.
You are receiving this mail because:
You are watching all bug changes.
https://bugs.winehq.org/show_bug.cgi?id=37132
Bug ID: 37132
Summary: Clang Static Analyzer: Uninitialized array item
Product: Wine
Version: 1.7.22
Hardware: x86-64
OS: Linux
Status: UNCONFIRMED
Severity: normal
Priority: P2
Component: -unknown
Assignee: wine-bugs(a)winehq.org
Reporter: lukebenes(a)hotmail.com
Clang Static Analyzer identifies Uninitialized array item
File: dlls/avifil32/api.c
Location: line 1753, column 10
Description: Assigned value is garbage or undefined
#define MAX_AVISTREAMS 8
...
HRESULT WINAPI AVISaveVW(....int nStreams ....)
{
...
//Declaring 8-item array, [0..7]
PAVISTREAM pInStreams[MAX_AVISTREAMS];
...
if (nStreams >= MAX_AVISTREAMS) {
WARN(...);
return AVIERR_INTERNAL;
}
...
//Initializing first 7 items, [0..6].
for (curStream = 0; curStream < nStreams; curStream++) {
pInStreams[curStream] = NULL;
pOutStreams[curStream] = NULL;
}
...
for (curStream = 0; curStream < nStreams; curStream++) {
...
if (curStream + 1 >= nStreams) {
/* move the others one up */
PAVISTREAM *ppas = &pInStreams[curStream];
int n = nStreams - (curStream + 1);
do {
*ppas = pInStreams[curStream + 1];
//Clang: Assigned value is garbage or undefined
} while (--n);
}
...
}
...
}
In this code, an array of 8 items is declared. The code will continue executing
as long as the nStreams variable is less than 8, i.e. 7 at most. All the loops
in this function with the conditional statement (curStream < nStreams) fail to
iterate through the last item, both before its initialization and when using
it. The line Clang displayed the message on is just that very line where the
eighth item with the index 7 is taken, as the (curStream + 1 >= nStreams)
condition will be true at curStream==6 and nStreams==7. Addressing the
pInStreams[curStream + 1] array will give us the last, previously uninitialized
item.
--
Do not reply to this email, post in Bugzilla using the
above URL to reply.
You are receiving this mail because:
You are watching all bug changes.
http://bugs.winehq.org/show_bug.cgi?id=34758
Bug #: 34758
Summary: Unhandled exception: divide by zero in 32-bit code
(0x7eabe0ee). under unbuntu 12.04 wine 1.6
Product: Wine
Version: unspecified
Platform: x86-64
OS/Version: other
Status: UNCONFIRMED
Severity: normal
Priority: P2
Component: -unknown
AssignedTo: wine-bugs(a)winehq.org
ReportedBy: Francis.Bougron(a)free.fr
Classification: Unclassified
Created attachment 46350
--> http://bugs.winehq.org/attachment.cgi?id=46350
Trace of debugger
This happens when starting "Microsoft money97 5.0.
I see bugs 33886 34451 300082.
It is probably the same thing.
--
Configure bugmail: http://bugs.winehq.org/userprefs.cgi?tab=email
Do not reply to this email, post in Bugzilla using the
above URL to reply.
------- You are receiving this mail because: -------
You are watching all bug changes.
https://bugs.winehq.org/show_bug.cgi?id=46256
Bug ID: 46256
Summary: EndUpdateResourceW should set errno on invalid handle
Product: Wine
Version: 3.17
Hardware: x86
OS: Linux
Status: UNCONFIRMED
Severity: normal
Priority: P2
Component: kernel32
Assignee: wine-bugs(a)winehq.org
Reporter: stu.axon(a)gmail.com
Distribution: ---
EndUpdateResourceW -- will return False if the handle is invalid but will not
set a proper
errorno(https://github.com/wine-mirror/wine/blob/master/dlls/kernel32/resou…
This bug was originally reported in pywin32-ctypes
https://github.com/enthought/pywin32-ctypes/issues/59
--
Do not reply to this email, post in Bugzilla using the
above URL to reply.
You are receiving this mail because:
You are watching all bug changes.
https://bugs.winehq.org/show_bug.cgi?id=42298
Bug ID: 42298
Summary: err:clipboard:convert_selection Timed out waiting for
SelectionNotify event
Product: Wine
Version: 2.0-rc6
Hardware: x86-64
OS: Linux
Status: NEW
Severity: trivial
Priority: P2
Component: -unknown
Assignee: wine-bugs(a)winehq.org
Reporter: 00cpxxx(a)gmail.com
Distribution: Debian
Although I'm a fan of the "console messages are not bugs" this is a little
annoying, it can repeat several times. Happens under heavy CPU/IO usage and
will repeat until CPU/IO goes back to "normal", this is the impression I have,
it could be something else.
It is sort of easy to reproduce and it is NOT present since the patch that
moved stuff ( http://source.winehq.org/git/wine.git/commitdiff/7d0ddff2 ), it
was something that was changed later I believe started less than 2 months ago.
I can try bisecting but it will take some time so if anybody (Julliard) has a
hint it will be better.
Am I the only affected?
--
Do not reply to this email, post in Bugzilla using the
above URL to reply.
You are receiving this mail because:
You are watching all bug changes.
https://bugs.winehq.org/show_bug.cgi?id=48795
Bug ID: 48795
Summary: Patches website mishandles HTML attachments
Product: WineHQ.org
Version: unspecified
Hardware: x86
OS: Linux
Status: NEW
Severity: normal
Priority: P2
Component: www-unknown
Assignee: wine-bugs(a)winehq.org
Reporter: fgouget(a)codeweavers.com
Distribution: ---
Here is an example:
https://source.winehq.org/patches/data/181590
Created from:
https://www.winehq.org/pipermail/wine-devel/2020-March/162581.html
This typically happens with replies to patches:
* In the plain text version the diff is prefixed with "> " characters so it is
not recognized as a patch.
* But in the HTML version or the email the quoting is done through HTML tags
which typically leave "+++" at the start of the line. As a result the HTML part
can look like a patch.
But it could also happen if someone sends a patch in an HTML-only email (e.g.
due to a mail client misconfiguration).
The TestBot normally ignores HTML attachments (see NewPatch() in Patches.pm).
But when patches go through the patches website the TestBot does not have
access to the raw email. Instead it gets the files prepared by the patches
website as in the first link. Such files erase the distinction between the
plain text and HTML part and so mislead the TestBot into creating a job.
--
Do not reply to this email, post in Bugzilla using the
above URL to reply.
You are receiving this mail because:
You are watching all bug changes.
https://bugs.winehq.org/show_bug.cgi?id=44875
Bug ID: 44875
Summary: Eve Online crash: Program error and trace files
Product: Wine
Version: unspecified
Hardware: x86
OS: Linux
Status: UNCONFIRMED
Severity: normal
Priority: P2
Component: -unknown
Assignee: wine-bugs(a)winehq.org
Reporter: enslinpj(a)gmail.com
Distribution: ---
Created attachment 60942
--> https://bugs.winehq.org/attachment.cgi?id=60942
Program Error reported initially
Eve Online crashes with program error on my 2017 iMac which is running MacOS
High Sierra. I have included a screen capture of the error as well as the
error log.
I am using the software as downloaded from the Eve Online site - and have made
no amendments to the Wine software
--
Do not reply to this email, post in Bugzilla using the
above URL to reply.
You are receiving this mail because:
You are watching all bug changes.
https://bugs.winehq.org/show_bug.cgi?id=37948
Bug ID: 37948
Summary: EVE Launcher crashes when importing/exporting patches
Product: Wine
Version: 1.7.33
Hardware: x86-64
OS: Linux
Status: UNCONFIRMED
Severity: minor
Priority: P2
Component: -unknown
Assignee: wine-bugs(a)winehq.org
Reporter: alex_y_xu(a)yahoo.ca
Distribution: Gentoo
Created attachment 50555
--> https://bugs.winehq.org/attachment.cgi?id=50555
Wine backtrace
Steps to reproduce:
Step 1: wine eve.exe
Step 2: Press gear icon, go to Patches.
Step 3: Press Import or Export.
Expected results:
Dialog opens.
Actual results:
Launcher crashes.
The bug can be reproduced after installing EVE without a subscription
(http://www.eveonline.com/), but it is quite a large download (~5 GB).
--
Do not reply to this email, post in Bugzilla using the
above URL to reply.
You are receiving this mail because:
You are watching all bug changes.
https://bugs.winehq.org/show_bug.cgi?id=42492
Bug ID: 42492
Summary: EVE Online cannot be started
Product: Wine
Version: unspecified
Hardware: x86
OS: Linux
Status: UNCONFIRMED
Severity: normal
Priority: P2
Component: -unknown
Assignee: wine-bugs(a)winehq.org
Reporter: tomsk.slovak(a)gmail.com
Distribution: ---
Created attachment 57358
--> https://bugs.winehq.org/attachment.cgi?id=57358
Crash log from EVE Online
After start EVE Online launcher, it crash.
--
Do not reply to this email, post in Bugzilla using the
above URL to reply.
You are receiving this mail because:
You are watching all bug changes.
https://bugs.winehq.org/show_bug.cgi?id=49672
Bug ID: 49672
Summary: Mesen Nes Emulator Crashes on Startup
Product: Wine
Version: 2.21
Hardware: x86-64
OS: Linux
Status: UNCONFIRMED
Severity: major
Priority: P2
Component: -unknown
Assignee: wine-bugs(a)winehq.org
Reporter: xsonesbackup(a)gmail.com
Distribution: ---
Created attachment 67912
--> https://bugs.winehq.org/attachment.cgi?id=67912
Crash info - backtrace.txt
Mesen NES emulator crashes on startup (does not load)
I think my wine version is 2.21 not sure though.
--
Do not reply to this email, post in Bugzilla using the
above URL to reply.
You are receiving this mail because:
You are watching all bug changes.
https://bugs.winehq.org/show_bug.cgi?id=42295
Bug ID: 42295
Summary: Loaded TurboCAD Delux 2D/3D into WINE. Appeared to
load normally, but when attempted to run program
received a critical error problem and the program shut
down. Attached is the back trace that was provided.
Product: Wine
Version: unspecified
Hardware: x86
OS: Linux
Status: UNCONFIRMED
Severity: normal
Priority: P2
Component: -unknown
Assignee: wine-bugs(a)winehq.org
Reporter: rsmach.rl(a)gmail.com
Distribution: ---
Created attachment 57016
--> https://bugs.winehq.org/attachment.cgi?id=57016
Report or error occurance that was generated when attempting to run the
program.
The program is set to run in a Windows 7 environment and was attempting to run
in Wine. The program is a computer aided design, TurboCAD Deluxe 2D/3D v. 20.
Loading of the program went smoothly but a critical error occurs when the
program is started,
--
Do not reply to this email, post in Bugzilla using the
above URL to reply.
You are receiving this mail because:
You are watching all bug changes.
http://bugs.winehq.org/show_bug.cgi?id=18562
Summary: foxtrader crash with page fault (regression)
Product: Wine
Version: 1.1.21
Platform: PC
OS/Version: Linux
Status: UNCONFIRMED
Severity: major
Priority: P2
Component: -unknown
AssignedTo: wine-bugs(a)winehq.org
ReportedBy: xrfang(a)gmail.com
Created an attachment (id=21225)
--> (http://bugs.winehq.org/attachment.cgi?id=21225)
log messages
FoxTrader (http://wizard.stock.hexun.com/webtornado/download/SetupGold.exe)
crashes with page fault, please see log.
Note
1. This is a regression
2. The program is Chinese, and it needs MFC42.DLL.
--
Configure bugmail: http://bugs.winehq.org/userprefs.cgi?tab=email
Do not reply to this email, post in Bugzilla using the
above URL to reply.
------- You are receiving this mail because: -------
You are watching all bug changes.
https://bugs.winehq.org/show_bug.cgi?id=41157
Bug ID: 41157
Summary: DX11 game "Heretics" crashes with an error message
after game menu is loaded
Product: Wine
Version: 1.9.16
Hardware: x86
OS: Windows
Status: UNCONFIRMED
Severity: normal
Priority: P2
Component: directx-d3d
Assignee: wine-bugs(a)winehq.org
Reporter: svyatpro(a)gmail.com
Created attachment 55378
--> https://bugs.winehq.org/attachment.cgi?id=55378
Heretics crash screenshot
When you run "Heretics" using WineD3D on Windows you recieve an error message.
Here is a link where you can find Heretics binaries and sources.
https://zachhoefler.com/portfolio/heretics/
Can somebody test it on Linux?
--
Do not reply to this email, post in Bugzilla using the
above URL to reply.
You are receiving this mail because:
You are watching all bug changes.
https://bugs.winehq.org/show_bug.cgi?id=44344
Bug ID: 44344
Summary: A serious bug with the program sparkchess
Product: Wine
Version: 2.21
Hardware: x86
OS: Linux
Status: UNCONFIRMED
Severity: major
Priority: P2
Component: -unknown
Assignee: wine-bugs(a)winehq.org
Reporter: sander.lagas(a)ziggo.nl
Distribution: ---
The game was installed and then it said there is a serious problem
--
Do not reply to this email, post in Bugzilla using the
above URL to reply.
You are receiving this mail because:
You are watching all bug changes.
https://bugs.winehq.org/show_bug.cgi?id=48744
Bug ID: 48744
Summary: Crash on installation of Dynacadd 98
Product: Wine
Version: unspecified
Hardware: x86
OS: Linux
Status: UNCONFIRMED
Severity: normal
Priority: P2
Component: -unknown
Assignee: wine-bugs(a)winehq.org
Reporter: mmcnally(a)mcnally.ca
Distribution: ---
Created attachment 66637
--> https://bugs.winehq.org/attachment.cgi?id=66637
backtrace.txt is the file produced when the installation of Dynacadd 98
stopped. If useful I can supply the Dynacadd 98 program. Plase advise how to do
the supply.
Crash on installation of Dynacadd 98
--
Do not reply to this email, post in Bugzilla using the
above URL to reply.
You are receiving this mail because:
You are watching all bug changes.
https://bugs.winehq.org/show_bug.cgi?id=41919
Bug ID: 41919
Summary: Regression : impossible to finish installation of
Indiana Jones The Original Trilogy
Product: Wine
Version: 1.9.24
Hardware: x86
OS: Linux
Status: UNCONFIRMED
Severity: normal
Priority: P2
Component: -unknown
Assignee: wine-bugs(a)winehq.org
Reporter: fevrier.simon(a)gmail.com
Distribution: Ubuntu
Ubuntu 16.10
It seems the regression appear between Wine 1.7.18 and 1.7.29.
Normally, no problem
Regression : a pop up window say "Insert the disk : 1" but the disk is inserted
Nothing different between versions in the poor logs.
The regression page say to test with the latest code. I will try but I don't
think it will be useful. For a "git bisect" method : too expensive for my
computer, but I will try to have a look at the commits' information.
It doesn't work In wine 1.9.24.
--
Do not reply to this email, post in Bugzilla using the
above URL to reply.
You are receiving this mail because:
You are watching all bug changes.
https://bugs.winehq.org/show_bug.cgi?id=40994
Bug ID: 40994
Summary: Exits only from pull-down menu, then reports error.
Product: Wine
Version: 1.9.14
Hardware: x86-64
OS: Linux
Status: UNCONFIRMED
Severity: minor
Priority: P2
Component: -unknown
Assignee: wine-bugs(a)winehq.org
Reporter: leslarkin(a)aim.com
Distribution: ---
Created attachment 55155
--> https://bugs.winehq.org/attachment.cgi?id=55155
Program error dump after program exit
I can't exit by clicking on the 'x' in the red circle in the upper left corner
of the app window. I also can't exit by right-clicking on the Wine icon in my
Launcher bar, and clicking 'Quit'. The only way to exit is by clicking the
app's 'Settings' pull-down menu, then clicking 'Exit'.
After an apparently successful exit, I get an error window with the attached
bactrace.txt file.
--
Do not reply to this email, post in Bugzilla using the
above URL to reply.
You are receiving this mail because:
You are watching all bug changes.
https://bugs.winehq.org/show_bug.cgi?id=42721
Bug ID: 42721
Summary: Freezing
Product: Wine
Version: unspecified
Hardware: Other
OS: Mac OS X
Status: UNCONFIRMED
Severity: major
Priority: P2
Component: -unknown
Assignee: wine-bugs(a)winehq.org
Reporter: marshall.lee.feather(a)gmail.com
Created attachment 57701
--> https://bugs.winehq.org/attachment.cgi?id=57701
the log it gives displays to me when it freezes up
about on average it freezes up 4 or five times a day during a 10 hr play. and
then this box pops up giving me info which i uploaded below. This started just
in the last week. have been playing for a year on same systems. Thanks guys
for all the hard work you put into this game for us. just hope i can play more
without more problems.
--
Do not reply to this email, post in Bugzilla using the
above URL to reply.
You are receiving this mail because:
You are watching all bug changes.
https://bugs.winehq.org/show_bug.cgi?id=42610
Bug ID: 42610
Summary: EVE-Online crashes
Product: Wine
Version: unspecified
Hardware: x86-64
OS: Mac OS X
Status: UNCONFIRMED
Severity: normal
Priority: P2
Component: -unknown
Assignee: wine-bugs(a)winehq.org
Reporter: m4xch3(a)gmail.com
Created attachment 57555
--> https://bugs.winehq.org/attachment.cgi?id=57555
This is bureport from the game
Periodically, during the game, the client falls. This often happens when
loading a large number of ships and departing from the station or with the
rapid opening of gaming windows.
--
Do not reply to this email, post in Bugzilla using the
above URL to reply.
You are receiving this mail because:
You are watching all bug changes.
https://bugs.winehq.org/show_bug.cgi?id=37780
Bug ID: 37780
Summary: After running a bash script from cmd, no prompt is
printed
Product: Wine
Version: unspecified
Hardware: x86-64
OS: Linux
Status: UNCONFIRMED
Severity: normal
Priority: P2
Component: cmd
Assignee: wine-bugs(a)winehq.org
Reporter: gm89(a)hotmail.it
Distribution: ---
If I run a bash script from wine's cmd, after execution the prompt is not
printed.
I believe this is the cause of an hang in my use case, I'm trying to interface
a windows program with my android phone by making it use the native adb binary;
the trick I used was to replace the provided "adb.exe" with a similarly named
bash script with this content:
#!/bin/bash
/usr/bin/adb $*
If I manually call adb.exe from cmd, the output of commands is correct but no
prompt is printed afterwards.
Tested with wine 1.7.33 under ubuntu 14.04.
--
Do not reply to this email, post in Bugzilla using the
above URL to reply.
You are receiving this mail because:
You are watching all bug changes.
https://bugs.winehq.org/show_bug.cgi?id=42741
Bug ID: 42741
Summary: StarCraft I: 1.18 PTR fails to initialize
ClientSdk.dll
Product: Wine
Version: 2.4
Hardware: x86-64
OS: Linux
Status: UNCONFIRMED
Severity: normal
Priority: P2
Component: -unknown
Assignee: wine-bugs(a)winehq.org
Reporter: li.davidm96(a)gmail.com
Distribution: ---
Created attachment 57743
--> https://bugs.winehq.org/attachment.cgi?id=57743
stderr output of Wine when running StarCraft.exe
The 1.18 public test release of the upcoming version of StarCraft I does not
launch, as ClientSdk.dll fails to initialize.
Tested with Wine 2.4 (latest from Arch repositories), in a fresh 64-bit
wineprefix. Architecture is AMD64.
The download is here:
https://us.battle.net/forums/en/starcraft/topic/20753915707
sha1sum:
2d6702a425f13659227814fbc903568d63daeb08
/home/lidavidm/Downloads/Starcraft+1.18+PTR+1202.zip
--
Do not reply to this email, post in Bugzilla using the
above URL to reply.
You are receiving this mail because:
You are watching all bug changes.
https://bugs.winehq.org/show_bug.cgi?id=49965
Bug ID: 49965
Summary: Wine crash upon clicking a password form
Product: Wine
Version: 5.0
Hardware: x86-64
OS: Linux
Status: UNCONFIRMED
Severity: normal
Priority: P2
Component: -unknown
Assignee: wine-bugs(a)winehq.org
Reporter: javi(a)legido.com
Distribution: ---
Created attachment 68360
--> https://bugs.winehq.org/attachment.cgi?id=68360
Backtrace
First of all many thanks to all the people involved in this project for their
time.
A) Steps to reproduce
1.1. Create below Dockerfile:
```
vim Dockerfile
```
With below content:
```
FROM debian:testing
RUN dpkg --add-architecture i386 && apt update
RUN apt install -y \
wine \
wine32 \
wine64 \
libwine \
libwine:i386 \
fonts-wine \
wget
RUN apt-get install -y \
cabextract \
unzip \
p7zip \
wget \
zenity \
kdialog \
winbind
RUN wget
https://raw.githubusercontent.com/Winetricks/winetricks/master/src/winetric…
RUN chmod +x winetricks
RUN mv winetricks /usr/local/bin
```
1.2. Create a docker container
```
docker run \
--name wine \
--net=host \
-e DISPLAY \
-v $HOME/.Xauthority:/root/.Xauthority \
-d localhost/wine \
/bin/sh -c "while true; do echo hello world; sleep 1; done"
docker exec -ti wine bash
```
1.3. Install dotnet in 32 bits architecture
```
env WINEARCH=win32 WINEPREFIX=~/.wine32 winetricks dotnet461
```
Here I tried with other versions, looks like there's no difference
1.4. Restart docker container (Window$ philosophy):
```
exit
docker restart wine; docker exec -ti wine bash
```
1.5. Install Adobe Digital Editions 4.5
```
cd
env WINEARCH=win32 WINEPREFIX=~/.wine32 wine .wine32/drive_c/Program\
Files/Adobe/Adobe\ Digital\ Editions\ 4.5/DigitalEditions.exe
```
I also tried with version 4.0, but same result
1.6. Try to register
1.6.1. Click 'Help', then 'Authorize computer'
1.6.2. Click the password field in the form
B) Expected behaviour
Being able to type the password
C) Found behaviour
The application crashes and exited. Sometimes I can't even relaunch it with
below command:
```
cd
env WINEARCH=win32 WINEPREFIX=~/.wine32 wine .wine32/drive_c/Program\
Files/Adobe/Adobe\ Digital\ Editions\ 4.5/DigitalEditions.exe
```
D) Error found
Below error appears in the docker terminal:
```
0009:err:eventlog:ReportEventW L"Application: DigitalEditions.exe\nFramework
Version: v4.0.30319\nDescription: The application requested process termination
through System.Environment.FailFast(string message).\nMessage: Unrecoverable
system error.\nStack:\n at System.Environment.FailFast(System.String)\n at
MS.Intern"...
```
Attached a Windows trace that one time I was able to get.
Thanks.
Javier
--
Do not reply to this email, post in Bugzilla using the
above URL to reply.
You are receiving this mail because:
You are watching all bug changes.
https://bugs.winehq.org/show_bug.cgi?id=38909
Bug ID: 38909
Summary: Notepad corrupts files saved as utf-8 without a byte
order mark (BOM)
Product: Wine
Version: 1.1.19
Hardware: x86
OS: Linux
Status: NEW
Keywords: download, source
Severity: minor
Priority: P2
Component: programs
Assignee: wine-bugs(a)winehq.org
Reporter: austinenglish(a)gmail.com
Distribution: ---
Created attachment 51843
--> https://bugs.winehq.org/attachment.cgi?id=51843
screenshot
See attached screenshot and test files (from bug 18191).
--
Do not reply to this email, post in Bugzilla using the
above URL to reply.
You are receiving this mail because:
You are watching all bug changes.
https://bugs.winehq.org/show_bug.cgi?id=50065
Bug ID: 50065
Summary: its too old to use
Product: Wine
Version: 5.20
Hardware: x86-64
OS: Mac OS X
Status: UNCONFIRMED
Severity: major
Priority: P2
Component: -unknown
Assignee: wine-bugs(a)winehq.org
Reporter: lankorchang1(a)gmail.com
its too old to use
--
Do not reply to this email, post in Bugzilla using the
above URL to reply.
You are receiving this mail because:
You are watching all bug changes.
https://bugs.winehq.org/show_bug.cgi?id=47957
Bug ID: 47957
Summary: critical error when trying to start pCLAMP
Product: Wine
Version: 4.0.1
Hardware: x86
OS: Mac OS X
Status: UNCONFIRMED
Severity: critical
Priority: P2
Component: winedbg
Assignee: wine-bugs(a)winehq.org
Reporter: katiekim3088(a)gmail.com
Created attachment 65462
--> https://bugs.winehq.org/attachment.cgi?id=65462
this is the backtrace that it gave me
I am unable to use my app
--
Do not reply to this email, post in Bugzilla using the
above URL to reply.
You are receiving this mail because:
You are watching all bug changes.
http://bugs.winehq.org/show_bug.cgi?id=22080
Summary: Wine removes custom drive mappings
Product: Wine
Version: 1.1.40
Platform: x86-64
OS/Version: Linux
Status: UNCONFIRMED
Severity: major
Priority: P2
Component: -unknown
AssignedTo: wine-bugs(a)winehq.org
ReportedBy: sub.mesa(a)gmail.com
Wine appears to be forgetting or removing my drive mappings. I have an NFS
filesystem mouned on /nfs, i am the owner of that directory with appropriate
write permissions. I do something like this:
# create new wine directory
mkdir /nfs/winetest
# populate wine directory
WINEPREFIX=/nfs/winetest/ winecfg
# Now i go to Drives tab, make a new D-drive, set it to /nfs, then click Apply
# close winecfg
# when i launch winecfg again, the /nfs D-drive is still there
# so far so good
# now launch some random application on the NFS-mount
cd /nfs/
WINEPREFIX=/nfs/winetest/ wine "D:\\prip\\setup.exe"
# result: wine: module not found; application does not start properly
# now check winecfg again:
WINEPREFIX=/nfs/winetest/ winecfg
# now our D-drive mapping isn't set to anything; its empty.
So it appears wine removes my custom drive mappings whenever an application is
launched or tries to access its DLLs located there. If i did something wrong,
i'm not aware of it. Wine should just accept the D-drive and launch the
application, not removing my drive mapping.
I also tested without using NFS; on my home directory.
mkdir ~/winetest
mkdir ~/driveD
WINEPREFIX=/home/<user>/winetest winecfg
# set drive D to map to /home/<user>/driveD/ type Local Disk
# click apply & close winecfg
cp -p ~/nfs/prip/setup.exe ~/driveD/
WINEPREFIX=/home/<user>/winetest/ wine "D:\\setup.exe"
# result: fails again, drive D gone.
I'm using Ubuntu 9.10 64-bit, wine 1.1.40 per winehq.org PPA; no modifications.
The latest .41 versions is not in your PPA yet, so i can't test. Can anyone
confirm this bug?
--
Configure bugmail: http://bugs.winehq.org/userprefs.cgi?tab=email
Do not reply to this email, post in Bugzilla using the
above URL to reply.
------- You are receiving this mail because: -------
You are watching all bug changes.
https://bugs.winehq.org/show_bug.cgi?id=49212
Bug ID: 49212
Summary: Cannot install Internet Explorer 11
Product: Wine
Version: 1.8
Hardware: x86-64
OS: Linux
Status: UNCONFIRMED
Severity: normal
Priority: P2
Component: -unknown
Assignee: wine-bugs(a)winehq.org
Reporter: bugzilla(a)tonne.to
Distribution: ---
Created attachment 67219
--> https://bugs.winehq.org/attachment.cgi?id=67219
bug report
I tried to instll Internet Explorer 11. Wine was "Windows 10". It fails. See
report.
--
Do not reply to this email, post in Bugzilla using the
above URL to reply.
You are receiving this mail because:
You are watching all bug changes.
http://bugs.winehq.org/show_bug.cgi?id=21855
Summary: WordPro Windows pull down does not show file names
Product: Wine
Version: 1.1.38
Platform: x86
OS/Version: Linux
Status: UNCONFIRMED
Severity: normal
Priority: P4
Component: -unknown
AssignedTo: wine-bugs(a)winehq.org
ReportedBy: ToddAndMargo(a)verizon.net
Created an attachment (id=26459)
--> (http://bugs.winehq.org/attachment.cgi?id=26459)
Missing file names in Windows pull down
Hi All,
Would you guys fix this for me?
I am using Lotus Word Pro N9.8.0208.1200. When you open two files (documents)
from the command line (the jpeg I have attached), then go to the "Window" pull
down to select which file to bring into focus, the file names are missing. If
you start Word Pro, then use File, Open to select two files, one at a time, the
second file does not show.
Many thanks,
-T
--
Configure bugmail: http://bugs.winehq.org/userprefs.cgi?tab=email
Do not reply to this email, post in Bugzilla using the
above URL to reply.
------- You are receiving this mail because: -------
You are watching all bug changes.
https://bugs.winehq.org/show_bug.cgi?id=42232
Bug ID: 42232
Summary: Sort version list by version number
Product: WineHQ Apps Database
Version: unspecified
Hardware: x86
URL: https://appdb.winehq.org/objectManager.php?sClass=appl
ication&iId=13986
OS: Linux
Status: UNCONFIRMED
Severity: enhancement
Priority: P2
Component: appdb-unknown
Assignee: wine-bugs(a)winehq.org
Reporter: cges30901(a)gmail.com
Distribution: ---
Versions of LINE (Powered by Naver) is not sorted correctly. Version 4.10.x.x
and 4.11.x.x is not at the bottom of the list. I guess this is because '1' in
10 is less than '3'?
--
Do not reply to this email, post in Bugzilla using the
above URL to reply.
You are receiving this mail because:
You are watching all bug changes.
https://bugs.winehq.org/show_bug.cgi?id=50220
Bug ID: 50220
Summary: 1-2-3 installs OK but closes on run before any info
entered
Product: Wine
Version: 4.0
Hardware: x86-64
OS: Linux
Status: UNCONFIRMED
Severity: normal
Priority: P2
Component: -unknown
Assignee: wine-bugs(a)winehq.org
Reporter: jlee27(a)btinternet.com
Distribution: ---
Created attachment 68726
--> https://bugs.winehq.org/attachment.cgi?id=68726
plain text report from Wine when 1-2-3 closes itself
Smartsuite installs OK from local CD (selected 1-2-3 + Approach only).
1-2-3 opens, looks OK, then closes itself before entry of any data.
backtrace output attached. Approach not tied yet.
--
Do not reply to this email, post in Bugzilla using the
above URL to reply.
You are receiving this mail because:
You are watching all bug changes.
https://bugs.winehq.org/show_bug.cgi?id=37541
Bug ID: 37541
Summary: Request for Enhancement: first time opening a program,
give the window some size
Product: Wine
Version: 1.7.30
Hardware: x86
OS: Linux
Status: UNCONFIRMED
Severity: enhancement
Priority: P2
Component: -unknown
Assignee: wine-bugs(a)winehq.org
Reporter: ToddAndMargo(a)zoho.com
Distribution: ---
Created attachment 49957
--> https://bugs.winehq.org/attachment.cgi?id=49957
first window
Hi All,
Wine 1.7.30 and Smart Suite.
Request for Enhancement:
Currently the first time you open a window (like Word Pro), the window has
horizontal length, but no vertical length, just the decoration bar.
The decoration says you are in Windowed mode. If you click on the Window mode
decoration, you get a full screen window. Click again and you just get the
decoration bar back.
This is really confusing as your thing you have click on the "roll up / roll
down" in the upper left of the decoration. The tip off that you did not, is
the arrow is pointing up. (That doesn't stop yo from clicking it anyway.)
The cure is to drag the line at the bottom of decoration downward, then you get
a windowed window back. That is unless the Role Up/Down arrow is now pointing
down from your clicking on it.
This is really confusing. Makes you think Wine is broken (again).
Would your please consider giving the first time a windows is open some size?
I have attached a picture of what the weird opening screen looks like.
Many thanks,
-T
--
Do not reply to this email, post in Bugzilla using the
above URL to reply.
You are receiving this mail because:
You are watching all bug changes.
https://bugs.winehq.org/show_bug.cgi?id=48636
Bug ID: 48636
Summary: Lotus Organizer 97, Wine 5.0, Debian Stretch. Lotus
Organizer icon speech bubbles display incorrectly -
they are on square black background.
Product: Wine
Version: 5.0
Hardware: x86
OS: Linux
Status: UNCONFIRMED
Severity: normal
Priority: P2
Component: winelib
Assignee: wine-bugs(a)winehq.org
Reporter: john.p.langley(a)gmail.com
Distribution: ---
Created attachment 66488
--> https://bugs.winehq.org/attachment.cgi?id=66488
Screenshot showing various icon speech-bubbles displaying incorrectly.
- Debian Stretch stable - all updates as at 20/02/2020
- Wine 5.0
- Lotus Organizer 97.
- Logged in with user privileges.
- LXDE environment.
When hovering mouse cursor over Lotus Organizer 97 icons, the information
speech bubbles display on black square background.
When LXDE (and possibly other window managers) is switched to another window,
the speech-bubble often remains on top.
See screen-shot.
--
Do not reply to this email, post in Bugzilla using the
above URL to reply.
You are receiving this mail because:
You are watching all bug changes.
https://bugs.winehq.org/show_bug.cgi?id=48708
Bug ID: 48708
Summary: Lotus Organizer 97, Wine 5.0, Debian Stretch. Lotus
Organizer 'Notepad' section - entries display as blank
until clicked on.
Product: Wine
Version: 5.0
Hardware: x86
OS: Linux
Status: UNCONFIRMED
Severity: normal
Priority: P2
Component: winelib
Assignee: wine-bugs(a)winehq.org
Reporter: john.p.langley(a)gmail.com
Distribution: ---
Created attachment 66580
--> https://bugs.winehq.org/attachment.cgi?id=66580
Notepad entry 'Test' showing initially as blank.
Lotus Organizer 97, Wine 5.0, Debian Stretch.
Lotus Organizer 'Notepad' section - entries display as blank until clicked on.
--
Do not reply to this email, post in Bugzilla using the
above URL to reply.
You are receiving this mail because:
You are watching all bug changes.
https://bugs.winehq.org/show_bug.cgi?id=40762
Bug ID: 40762
Summary: Approach 97: Error Message When Opening From Network
Path
Product: Wine
Version: 1.9.11
Hardware: x86
OS: Linux
Status: UNCONFIRMED
Severity: minor
Priority: P2
Component: -unknown
Assignee: wine-bugs(a)winehq.org
Reporter: crashdance(a)charter.net
Distribution: Mint
When opening a database (APR) file from a CIFS mapped Windows network share
using a drive letter in dosdevices Approach fails to open the file. The error
message is "Cannot open database "Z:\examplefile.dbf" because it is encrypted."
This problem persists regardless of the compatibility mode in the Wine config.
The program works correctly in a modern version of Windows and a Windows
virtual machine connected to the same LAN.
--
Do not reply to this email, post in Bugzilla using the
above URL to reply.
You are receiving this mail because:
You are watching all bug changes.
http://bugs.winehq.org/show_bug.cgi?id=35075
Bug #: 35075
Summary: BoincTasks: very high CPU utilisation
Product: Wine
Version: 1.7.6
Platform: x86-64
URL: http://www.efmer.eu/download/boinc/boinc_tasks/unified
/setup_32_64_boinc_tasks_1_5_8.exe
OS/Version: Linux
Status: NEW
Keywords: download, performance
Severity: trivial
Priority: P2
Component: -unknown
AssignedTo: wine-bugs(a)winehq.org
ReportedBy: imwellcushtymelike(a)gmail.com
Classification: Unclassified
Created attachment 46782
--> http://bugs.winehq.org/attachment.cgi?id=46782
Wine 1.7.6 console output
Under Windows XP BoincTasks runs at around 22% when updating (takes a few
seconds) but idles around 1-2%. Under Wine it runs around 60% all the time. I
cannot work out why. The exact same setup was tested in both cases.
http://www.efmer.eu/download/boinc/boinc_tasks/unified/setup_32_64_boinc_ta…
Following install you are asked if you are running Windows or Linux with Wine,
choosing either option has the same effect.
Original post:
http://efmer.com/forum/index.php?topic=1140
--
Configure bugmail: http://bugs.winehq.org/userprefs.cgi?tab=email
Do not reply to this email, post in Bugzilla using the
above URL to reply.
------- You are receiving this mail because: -------
You are watching all bug changes.
http://bugs.winehq.org/show_bug.cgi?id=26549
Summary: GomezPEER fails to set processor priority
Product: Wine
Version: 1.3.16
Platform: x86-64
URL: http://lastmile.gomez.com/PEERInstall.exe
OS/Version: Linux
Status: NEW
Keywords: download
Severity: minor
Priority: P2
Component: -unknown
AssignedTo: wine-bugs(a)winehq.org
ReportedBy: kennybobs(a)o2.co.uk
GomezPEER sets its background process (an instance of java.exe) to the lowest
(idle) priority in Windows. It fails to do so under Linux. Does Wine lack the
ability to set process priorities, perhaps?
Apologies if a similar bug is already open but I could not find one.
On newer systems this is not a problem, but on older system the PEER can
consume 100% CPU while processing. The app is designed so that performance of
the PC is not affected, which of course it isn't under Windows (save the usual
Windows-related problems) but it is under Wine.
I'm not sure if I/O priority is also set.
The following does not work as a workaround:
$nice -n19 wine ~/blah/GomezPEER.exe
because this then sets all the Wine components to -n19 and can badly affect the
performance of other apps running under Wine.
Instead, the workaround I use is:
$wineserver -p15
$nice -n19 wine ~/blah/GomezPEER.exe
This way the wineserver remains at normal priority. winedevice.exe in this
case still receives -n19 priority, however.
Console log:
fixme:win:EnumDisplayDevicesW ((null),0,0x73a83c,0x00000000), stub!
fixme:win:EnumDisplayDevicesW ((null),1,0x73a83c,0x00000000), stub!
fixme:ddraw:DirectDrawEnumerateExA flags 0x00000001 not handled
fixme:win:EnumDisplayDevicesW ((null),0,0x74b69c,0x00000000), stub!
fixme:font:WineEngCreateFontInstance Untranslated charset 255
fixme:time:GetSystemTimes (0xd9ee5a0,0xd9ee5b0,0xd9ee5a8): Stub!
fixme:time:GetSystemTimes (0xd9ee5a0,0xd9ee5b0,0xd9ee5a8): Stub!
--
Configure bugmail: http://bugs.winehq.org/userprefs.cgi?tab=email
Do not reply to this email, post in Bugzilla using the
above URL to reply.
------- You are receiving this mail because: -------
You are watching all bug changes.
http://bugs.winehq.org/show_bug.cgi?id=17820
Summary: Chromium test_shell_tests fail on Wine
Product: Wine
Version: 1.1.17
Platform: Other
URL: http://chromium.org
OS/Version: other
Status: NEW
Keywords: download
Severity: normal
Priority: P2
Component: -unknown
AssignedTo: wine-bugs(a)winehq.org
ReportedBy: dank(a)kegel.com
To run Chromium's test_shell_tests.exe, copy
net/data, skia/data, webkit/data, third_party/py*, and third_party/tlslite
from the source tree. (This is quite a bit of data, so I hesitate
to post a tarball.) Then do
$ wine chrome/Debug/test_shell_tests.exe
The following tests fail on wine but not windows for me:
[ FAILED ] UniscribeTest.TooBig
[ FAILED ] VectorCanvasTest.BasicDrawing
[ FAILED ] VectorCanvasTest.Circles
[ FAILED ] VectorCanvasTest.DiagonalLines
[ FAILED ] VectorCanvasTest.PathEffects
[ FAILED ] VectorCanvasTest.Bitmaps
[ FAILED ] VectorCanvasTest.Matrix
--
Configure bugmail: http://bugs.winehq.org/userprefs.cgi?tab=email
Do not reply to this email, post in Bugzilla using the
above URL to reply.
------- You are receiving this mail because: -------
You are watching all bug changes.
http://bugs.winehq.org/show_bug.cgi?id=22649
Summary: CDBurnerXP 4.3.x crashes when trying to erase a DVD-RW
Product: Wine
Version: 1.1.44
Platform: x86-64
URL: http://cdburnerxp.se/download?more-options
OS/Version: Linux
Status: UNCONFIRMED
Severity: normal
Priority: P2
Component: -unknown
AssignedTo: wine-bugs(a)winehq.org
ReportedBy: RandomAccountName(a)mail.com
Created an attachment (id=27861)
--> (http://bugs.winehq.org/attachment.cgi?id=27861)
Crash log
After choosing "erase disc" in the main menu and then clicking the erase button
(while a DVD-RW disc is inserted in a drive the program can detect), the
program produces an error dialog:
Erasing the disc failed for the following reason: Exception from HRESULT:
0x8001010E (RPC_E_WRONG_THREAD)
Clicking OK to this message results in the MS error report tool popping up,
followed by the Wine crash dialog.
Note: this program needs dotnet20, and it needs the workaround from bug 18012,
comment 2 to be able to detect drives in this section.
--
Configure bugmail: http://bugs.winehq.org/userprefs.cgi?tab=email
Do not reply to this email, post in Bugzilla using the
above URL to reply.
------- You are receiving this mail because: -------
You are watching all bug changes.
http://bugs.winehq.org/show_bug.cgi?id=29780
Bug #: 29780
Summary: XPS Viewer EP shows garbage in the toolbar background
Product: Wine
Version: 1.4-rc2
Platform: x86-64
URL: http://download.microsoft.com/download/2/5/2/2526f55d-
32bc-410f-be18-164ba67ae07d/XPSEP XP and Server 2003
32 bit.msi
OS/Version: Linux
Status: UNCONFIRMED
Severity: trivial
Priority: P2
Component: comctl32
AssignedTo: wine-bugs(a)winehq.org
ReportedBy: RandomAccountName(a)mail.com
CC: bunglehead(a)gmail.com
Classification: Unclassified
Regression SHA1: 1c1b1c0073c3dea34ff4096d749a459accf5e337
Created attachment 38676
--> http://bugs.winehq.org/attachment.cgi?id=38676
Terminal output
The background of the toolbar in XPS Viewer EP is not displayed properly,
showing garbage (previous screen content). This worked in 1.4-rc1, and
regression testing indicated:
1c1b1c0073c3dea34ff4096d749a459accf5e337 is the first bad commit
commit 1c1b1c0073c3dea34ff4096d749a459accf5e337
Author: Nikolay Sivov <nsivov(a)codeweavers.com>
Date: Wed Feb 1 00:07:00 2012 +0300
comctl32: More tests for Toolbar window style handling.
:040000 040000 dd921cd22cea799bb21627f6e80aba024d087098
ee93a6dccb2bc9c894dc6330dbae8fc4650b2b82 M dlls
Reverting the patch fixed it.
To reproduce:
1. In system32, make a copy of acledit.dll named xpssvcs.dll
2. Install (occasionally crashes - retry if needed)
3. wine xpsrchvw
--
Configure bugmail: http://bugs.winehq.org/userprefs.cgi?tab=email
Do not reply to this email, post in Bugzilla using the
above URL to reply.
------- You are receiving this mail because: -------
You are watching all bug changes.
http://bugs.winehq.org/show_bug.cgi?id=25410
Summary: MS Paint doesn't refresh scrollbars properly
Product: Wine
Version: 1.3.8
Platform: x86-64
URL: http://download.microsoft.com/download/winntwks40/pain
t/1/nt4/en-us/paintnt.exe
OS/Version: Linux
Status: UNCONFIRMED
Severity: trivial
Priority: P2
Component: -unknown
AssignedTo: wine-bugs(a)winehq.org
ReportedBy: RandomAccountName(a)mail.com
In MS Paint (installed with winetricks) the scrollbars don't seem to refresh
when they should unless the scrollbar area is clicked on.
Simple way to reproduce: Ensure that the canvas is smaller than the window (so
no scrollbars are visible) then zoom in on a portion of the picture (ensure
it's not the entire picture). Scrollbars should appear, but instead, they're
invisible. After clicking in the area where they should be, they become
visible.
Terminal output: nothing.
--
Configure bugmail: http://bugs.winehq.org/userprefs.cgi?tab=email
Do not reply to this email, post in Bugzilla using the
above URL to reply.
------- You are receiving this mail because: -------
You are watching all bug changes.
https://bugs.winehq.org/show_bug.cgi?id=45221
Bug ID: 45221
Summary: AppDB: "Your Version" column in maintained apps doesnt
show word "staging"
Product: WineHQ Apps Database
Version: unspecified
Hardware: Other
OS: Linux
Status: UNCONFIRMED
Severity: normal
Priority: P2
Component: appdb-unknown
Assignee: wine-bugs(a)winehq.org
Reporter: havran.jan(a)email.cz
Distribution: ---
"Your Version" column in "Maintainership Overview" menu doesnt show word
"staging", while "Current Version" column does (for staging releases even if
"your" test result is the latest (current) one). It happens for example for
these versions maintained by me: Vietcong (MP Demo FistAlpha) [1], Air
Missions: HIND (Steam) [2].
It is confusing, because it looks like I posted test result with "testing"
version and after that someone else posted test with the same version, but
"staging" in this case, which is not true.
[1] https://appdb.winehq.org/objectManager.php?sClass=version&iId=36433
[2] https://appdb.winehq.org/objectManager.php?sClass=version&iId=35881
--
Do not reply to this email, post in Bugzilla using the
above URL to reply.
You are receiving this mail because:
You are watching all bug changes.
https://bugs.winehq.org/show_bug.cgi?id=49744
Bug ID: 49744
Summary: fbclid should be a numeric value
Product: WineHQ Apps Database
Version: unspecified
Hardware: x86
OS: Linux
Status: UNCONFIRMED
Severity: normal
Priority: P2
Component: appdb-unknown
Assignee: wine-bugs(a)winehq.org
Reporter: huupoke12(a)gmail.com
Distribution: ---
URLs to AppDB posted on Facebook will generate an fbclid parameter in the URL.
But that parameter is currently a long alphanumeric string, not a numeric only
string, so the bug will happen.
But why does the AppDB processing this parameter? Can it just ignore the
parameter?
--
Do not reply to this email, post in Bugzilla using the
above URL to reply.
You are receiving this mail because:
You are watching all bug changes.
http://bugs.winehq.org/show_bug.cgi?id=22798
Summary: Invalid Wine version results in hidden / lost /
invisible test results entry
Product: WineHQ Apps Database
Version: unspecified
Platform: x86
OS/Version: All
Status: UNCONFIRMED
Severity: normal
Priority: P2
Component: appdb-unknown
AssignedTo: wine-bugs(a)winehq.org
ReportedBy: sparr0(a)gmail.com
I submitted test results for Time of Defiance
(http://appdb.winehq.org/objectManager.php?sClass=version&iId=8261) with an
invalid Wine Version number (1.1.45). The form accepted my submission, and I
was later emailed that my results had been added (perhaps because I was the
submitter, perhaps because I am the maintainer of the version). Now
http://appdb.winehq.org/objectManager.php?sClass=version&iId=8261&iTestingI…
displays my new results in the "Selected Test Results" box, but on no page are
the details of the results visible in the "Test Results" box.
I expect two fixes are required here. First, more input validation on the
submission page. Second, whatever is preventing this entry from showing up
under Test Results.
--
Configure bugmail: http://bugs.winehq.org/userprefs.cgi?tab=email
Do not reply to this email, post in Bugzilla using the
above URL to reply.
------- You are receiving this mail because: -------
You are watching all bug changes.
http://bugs.winehq.org/show_bug.cgi?id=23124
Summary: Philippine English locale defaults to wrong SUBLANG
Product: Wine
Version: unspecified
Platform: All
OS/Version: All
Status: NEW
Keywords: download, source
Severity: trivial
Priority: P4
Component: -unknown
AssignedTo: wine-bugs(a)winehq.org
ReportedBy: kennybobs(a)o2.co.uk
I understand that following 1.2 .po file are going to be used, so this should
be easier to resolve then.
Philippine English follows American English rules, but currently defaults to
pick up SUBLANG_NEUTRAL which is British English. It should be picking up
SUBLANG_DEFAULT for American English.
I'm not sure if this can be changed before the introduction of .po files but
it's not urgent.
http://en.wikipedia.org/wiki/Philippine_English
--
Configure bugmail: http://bugs.winehq.org/userprefs.cgi?tab=email
Do not reply to this email, post in Bugzilla using the
above URL to reply.
------- You are receiving this mail because: -------
You are watching all bug changes.
https://bugs.winehq.org/show_bug.cgi?id=46439
Bug ID: 46439
Summary: error when installs mBlock 5 for PC
Product: Wine-staging
Version: 3.6
Hardware: x86-64
OS: Linux
Status: UNCONFIRMED
Severity: normal
Priority: P2
Component: -unknown
Assignee: wine-bugs(a)winehq.org
Reporter: paulo_fg(a)hotmail.com
CC: leslie_alistair(a)hotmail.com, z.figura12(a)gmail.com
Distribution: ---
software link: http://www.mblock.cc/mblock-software/
error:
012d:err:ole:CoGetClassObject class {56fdf344-fd6d-11d0-958a-006097c9a090} not
registered
012d:err:ole:CoGetClassObject no class object
{56fdf344-fd6d-11d0-958a-006097c9a090} could be created for context 0x1
winecfg: Windows 10
Tested on Linux Mint Tessa
--
Do not reply to this email, post in Bugzilla using the
above URL to reply.
You are receiving this mail because:
You are watching all bug changes.
http://bugs.winehq.org/show_bug.cgi?id=25543
Summary: Submitter's test results missing from 'Test Results'
table
Product: WineHQ Apps Database
Version: unspecified
Platform: x86
OS/Version: Linux
Status: UNCONFIRMED
Severity: normal
Priority: P2
Component: appdb-unknown
AssignedTo: wine-bugs(a)winehq.org
ReportedBy: hoehle(a)users.sourceforge.net
The link in the mail that the maintainer receives, e.g.
"Test Results submitted for version 1.0 of X by Y"
http://appdb.winehq.org/objectManager.php?sClass=version&iId=4219&iTestingI…
leads to a page that shows the submitter's text with the title
"Selected Test Results (selected in 'Test Results' table below)"
However, the OS/version/rating 'test results' line corresponding to the
submission is missing. Instead the topmost line displays an old (known) entry.
This is really confusing and irritating.
Furthermore, the page displayed does not show a "process" or "reply" buttons. I
need to go to my queue and identify this entry among all the elements of the
queue in order to process it.
I believe both things worked well in the past -- 2-3 years ago?
--
Configure bugmail: http://bugs.winehq.org/userprefs.cgi?tab=email
Do not reply to this email, post in Bugzilla using the
above URL to reply.
------- You are receiving this mail because: -------
You are watching all bug changes.
https://bugs.winehq.org/show_bug.cgi?id=42630
Bug ID: 42630
Summary: Submitted application test shows no test data when
previewed
Product: WineHQ Apps Database
Version: unspecified
Hardware: x86
OS: Linux
Status: UNCONFIRMED
Severity: normal
Priority: P2
Component: appdb-unknown
Assignee: wine-bugs(a)winehq.org
Reporter: fjfrackiewicz(a)gmail.com
Distribution: ---
Hi,
As per Roseanne's request in this bug report
https://bugs.winehq.org/show_bug.cgi?id=34647#c23 I am filing a new bug that I
have come across in the AppDB.
I have submitted this test for GOG Galaxy
https://appdb.winehq.org/objectManager.php?bIsQueue=false&bIsRejected=false…
and when I go to preview it, there is no test data shown whatsoever.
I made the report while using Firefox 52.0 in case it helps.
--
Do not reply to this email, post in Bugzilla using the
above URL to reply.
You are receiving this mail because:
You are watching all bug changes.
https://bugs.winehq.org/show_bug.cgi?id=48468
Bug ID: 48468
Summary: Add "Bronze" and "Garbage" top-10 lists to the appdb
landing page
Product: WineHQ.org
Version: unspecified
Hardware: x86-64
OS: Linux
Status: UNCONFIRMED
Severity: enhancement
Priority: P2
Component: www-unknown
Assignee: wine-bugs(a)winehq.org
Reporter: jonwsb(a)gmail.com
Distribution: ---
The top-10 lists on appdb.winehq.org are a very nice feature of the site. Their
purpose of showing off what popular programs work in wine is very useful to new
users and I think adding the "Bronze" and "Garbage" ratings to the page will
also provide valuable information to new users as well as contributors. For new
users it will give quick access to information on programs they may be planning
on attempting to use with wine. For advanced users and contributors it will be
a useful tool to gauge which programs need high quality testing and possibly
give inspiration for developing patches to improve bronze and garbage rating
entries.
My biggest concern with adding these top-10 lists would be increasing the size
of the page even more than it already is though it will also probably drive
users of the appdb to vote for more applications overall.
--
Do not reply to this email, post in Bugzilla using the
above URL to reply.
You are receiving this mail because:
You are watching all bug changes.
https://bugs.winehq.org/show_bug.cgi?id=42333
Bug ID: 42333
Summary: "Top garbage" list on AppDB
Product: WineHQ Apps Database
Version: unspecified
Hardware: Other
OS: other
Status: UNCONFIRMED
Severity: enhancement
Priority: P2
Component: appdb-unknown
Assignee: wine-bugs(a)winehq.org
Reporter: roothorick(a)gmail.com
Just a simple top 10 or top 25 list of the most active apps with a garbage
rating. It would be an easy at-a-glance forecast of what apps (and therefore,
indirectly, what bugs) are the greatest concern for Wine users.
--
Do not reply to this email, post in Bugzilla using the
above URL to reply.
You are receiving this mail because:
You are watching all bug changes.
https://bugs.winehq.org/show_bug.cgi?id=44333
Bug ID: 44333
Summary: Alphabetical order for monitored Applications
Product: WineHQ Apps Database
Version: unspecified
Hardware: x86-64
OS: Linux
Status: UNCONFIRMED
Severity: minor
Priority: P2
Component: appdb-unknown
Assignee: wine-bugs(a)winehq.org
Reporter: mywine(a)schiermeier-it.de
Distribution: ---
Created attachment 60207
--> https://bugs.winehq.org/attachment.cgi?id=60207
Actual view of AppDBs side bar at the end of this bar
Two points about the side bar in AppDB:
1.) Would like to have either a possibility to choose the order or this list
should be in alphabetical order
2.) The "Maintainer box" should be before the list of monitored applications.
--
Do not reply to this email, post in Bugzilla using the
above URL to reply.
You are receiving this mail because:
You are watching all bug changes.
https://bugs.winehq.org/show_bug.cgi?id=46461
Bug ID: 46461
Summary: Game Version is on the wrong game page
Product: WineHQ Apps Database
Version: unspecified
Hardware: x86-64
OS: Linux
Status: UNCONFIRMED
Severity: normal
Priority: P2
Component: appdb-unknown
Assignee: wine-bugs(a)winehq.org
Reporter: gero45(a)mr-gero.de
Distribution: ---
I think that Version "3.1415926" on the Page for Civilization IV:Colonization
(https://appdb.winehq.org/objectManager.php?sClass=version&iId=953) doesn't
belong to this Game.
Instead it probably belongs to the original "Sid Meier's Colonization"
(https://www.mobygames.com/game/windows/sid-meiers-colonization) instead.
Reasons:
-there is no such Version for Civilization IV:Colonization
-the last test mentions a patch for Win95 and a Win16 installer version, this
would fit with the Game from 1995.
--
Do not reply to this email, post in Bugzilla using the
above URL to reply.
You are receiving this mail because:
You are watching all bug changes.
https://bugs.winehq.org/show_bug.cgi?id=48607
Bug ID: 48607
Summary: Incorrect developer name for YGOPro
Product: WineHQ Apps Database
Version: unspecified
Hardware: x86
OS: Linux
Status: UNCONFIRMED
Severity: normal
Priority: P2
Component: appdb-unknown
Assignee: wine-bugs(a)winehq.org
Reporter: cumandr+wine(a)gmail.com
Distribution: ---
https://appdb.winehq.org/objectManager.php?sClass=application&iId=14884
YGOPro is not developed by "Kaiba Corporation". Numerous forks exist, some
violating the GPL, but the original codebase is located at
https://github.com/Fluorohydride/ygopro and not led by any organization.
--
Do not reply to this email, post in Bugzilla using the
above URL to reply.
You are receiving this mail because:
You are watching all bug changes.
https://bugs.winehq.org/show_bug.cgi?id=49008
Bug ID: 49008
Summary: Invalid To: tag in registration confirmation email
Product: WineHQ.org
Version: unspecified
Hardware: x86
OS: Linux
Status: UNCONFIRMED
Severity: normal
Priority: P2
Component: www-unknown
Assignee: wine-bugs(a)winehq.org
Reporter: lxahotqu2zbx(a)mail.ru
Distribution: ---
Created attachment 66984
--> https://bugs.winehq.org/attachment.cgi?id=66984
The email file
Hello,
The site sends an email to confirm registration. The To: tag must contain the
address of the user to whom the e-mail is addressed following the e-mail
standards. Letters from you are placed in the spam folder because the tag
currently has the value appdb-noreply(a)winehq.org. I ask you fix the problem.
I attached the email file to this report.
Kind Regards,
Ilia
--
Do not reply to this email, post in Bugzilla using the
above URL to reply.
You are receiving this mail because:
You are watching all bug changes.
https://bugs.winehq.org/show_bug.cgi?id=49677
Bug ID: 49677
Summary: Registering app fails with database error
Product: WineHQ Apps Database
Version: unspecified
Hardware: x86
OS: Linux
Status: UNCONFIRMED
Severity: normal
Priority: P2
Component: appdb-unknown
Assignee: wine-bugs(a)winehq.org
Reporter: cbase2015-winebug(a)yahoo.de
Distribution: ---
Created attachment 67917
--> https://bugs.winehq.org/attachment.cgi?id=67917
Error message when trying to submit new app "α-Orionis Centurion"
Trying to submit a new app with the name "α-Orionis Centurion" fails (see
screenshot).
--
Do not reply to this email, post in Bugzilla using the
above URL to reply.
You are receiving this mail because:
You are watching all bug changes.
http://bugs.winehq.org/show_bug.cgi?id=18790
Summary: Default search does not include resolved bugs
Product: WineHQ Bugzilla
Version: unspecified
Platform: PC
OS/Version: Linux
Status: NEW
Keywords: download, source
Severity: enhancement
Priority: P3
Component: bugzilla-unknown
AssignedTo: wine-bugs(a)winehq.org
ReportedBy: kennybobs(a)o2.co.uk
The default search (the search box at the top of this page) does not include
closed bugs (rightly so), but it also does not include resolved bugs. This
leads to duplicates that could be avoided.
See Bug 18601 - a recent regression that is fixed by the next release, but
anyone searching for an open bug for Google Sketchup will not see it unless
they choose to run an advanced search, which some users clearly don't.
I'm sure this is a simple change to the code.
--
Configure bugmail: http://bugs.winehq.org/userprefs.cgi?tab=email
Do not reply to this email, post in Bugzilla using the
above URL to reply.
------- You are receiving this mail because: -------
You are watching all bug changes.
http://bugs.winehq.org/show_bug.cgi?id=24566
Summary: bugzilla adds mr.bugs to cc list?
Product: WineHQ Bugzilla
Version: unspecified
Platform: x86
OS/Version: Linux
Status: NEW
Severity: normal
Priority: P2
Component: bugzilla-unknown
AssignedTo: wine-bugs(a)winehq.org
ReportedBy: dank(a)kegel.com
Bugs start out with Mr. Bugs as the default assignee, which is evidently
intended so the mailing list gets copied on all bug changes. That's fine.
But under some situations, bugzilla seems to also automatically add
mr. bugs to the cc list.
For instance, here:
http://www.winehq.org/pipermail/wine-bugs/2010-September/251648.html
Whereupon Dmitry promptly removed it from the cc:
http://www.winehq.org/pipermail/wine-bugs/2010-September/251690.html
Austin verified that this had been done automatically by repeating his
component change:
http://www.winehq.org/pipermail/wine-bugs/2010-September/251728.html
and then removed the extra cc manually in the next change.
What's going on here? Should that cc be added automatically or not?
--
Configure bugmail: http://bugs.winehq.org/userprefs.cgi?tab=email
Do not reply to this email, post in Bugzilla using the
above URL to reply.
------- You are receiving this mail because: -------
You are watching all bug changes.
https://bugs.winehq.org/show_bug.cgi?id=39009
Bug ID: 39009
Summary: "Importance" link on bug report form opens in wrong
place on fields descriptions page
Product: WineHQ Bugzilla
Version: unspecified
Hardware: x86
OS: Linux
Status: NEW
Severity: normal
Priority: P2
Component: bugzilla-unknown
Assignee: wine-bugs(a)winehq.org
Reporter: dimesio(a)earthlink.net
Distribution: ---
The fields description page has two sections for Importance. The first one is
right below the status definitions table; right below it are the definitions
for Priority and Severity (which is what users need to see). The second
Importance section is toward the bottom of the page, and it just describes the
field as "the combination of its Priority and Severity" without the severity
definitions anywhere in sight.
Clicking the Importance link on the bug report form opens the page at the
second Importance section when it should open at the first one (or even better,
at the Severity section, since that's what we really want users to see). The
result is that users don't see the actual definitions for severity even if they
do bother to click the link.
--
Do not reply to this email, post in Bugzilla using the
above URL to reply.
You are receiving this mail because:
You are watching all bug changes.
http://bugs.winehq.org/show_bug.cgi?id=12091
Summary: out of place text on bugzilla component description page
Product: WineHQ Bugzilla
Version: unspecified
Platform: Other
OS/Version: other
Status: NEW
Severity: trivial
Priority: P2
Component: bugzilla-unknown
AssignedTo: wine-bugs(a)winehq.org
ReportedBy: thestig(a)google.com
I can't seem to find the change for this in bugzilla.git...
On http://bugs.winehq.org/enter_bug.cgi, someone added the text:
<-- You probably want to use that link there!
Wine bugs. Submit bugs related to Wine here.
<-- Use this if in doubt!
but it also appears on this page:
http://bugs.winehq.org/describecomponents.cgi?product=Wine
which doesn't make any sense.
--
Configure bugmail: http://bugs.winehq.org/userprefs.cgi?tab=email
Do not reply to this email, post in Bugzilla using the
above URL to reply.
------- You are receiving this mail because: -------
You are watching all bug changes.
https://bugs.winehq.org/show_bug.cgi?id=41825
Bug ID: 41825
Summary: Typo in "Comments Disabled"
Product: WineHQ.org
Version: unspecified
Hardware: x86
OS: Linux
Status: UNCONFIRMED
Severity: normal
Priority: P2
Component: www-unknown
Assignee: wine-bugs(a)winehq.org
Reporter: plata(a)mailbox.org
Distribution: ---
"Comments for this application have be disabled becuase there are no
maintainers."
--
Do not reply to this email, post in Bugzilla using the
above URL to reply.
You are receiving this mail because:
You are watching all bug changes.
https://bugs.winehq.org/show_bug.cgi?id=46624
Bug ID: 46624
Summary: StarCraft: Remastered Edition disabled Monitors, Gamma
Correction and Real-Time Lightning configuration
Product: Wine-staging
Version: 4.0
Hardware: x86
OS: Linux
Status: UNCONFIRMED
Severity: normal
Priority: P2
Component: -unknown
Assignee: wine-bugs(a)winehq.org
Reporter: linards.liepins(a)gmail.com
CC: leslie_alistair(a)hotmail.com, z.figura12(a)gmail.com
Distribution: ---
Created attachment 63525
--> https://bugs.winehq.org/attachment.cgi?id=63525
screenshot
Attaching Screenshot.
Logs not provided as I am using Battle.net Launcher.
Distro: Fedora 29 x64
System details /
Graphics:
Device-1: AMD Ellesmere [Radeon RX 470/480/570/570X/580/580X/590]
vendor: XFX Pine driver: amdgpu v: kernel bus ID: 01:00.0
chip ID: 1002:67df
Display: x11 server: Fedora Project X.org 1.20.3 driver: amdgpu
compositor: gnome-shell v: 3.30.2 resolution: 1920x1080~60Hz
OpenGL: renderer: Radeon RX 580 Series (POLARIS10 DRM 3.27.0
4.20.6-200.fc29.x86_64 LLVM 7.0.1)
v: 4.5 Mesa 18.3.3 direct render: Yes
NOTE: Mesa upgraded from Mesa 18.2.8 to 18.3.3 via
https://copr.fedorainfracloud.org/coprs/petrb/mesa/
--
Do not reply to this email, post in Bugzilla using the
above URL to reply.
You are receiving this mail because:
You are watching all bug changes.
http://bugs.winehq.org/show_bug.cgi?id=34710
Bug #: 34710
Summary: Can't register/login with Kindle for PC
Product: Wine
Version: unspecified
Platform: x86
OS/Version: Linux
Status: UNCONFIRMED
Severity: normal
Priority: P2
Component: -unknown
AssignedTo: wine-bugs(a)winehq.org
ReportedBy: rosc2112(a)yahoo.com
Classification: Unclassified
Trying to register Kindle for Pc so it'll login to my amazon account, it's
giving an error "Registration Failed, please try again (99)
Upgraded the latest version of wine, v 1.6 and still having the same problem,
except now I'm not even getting any kind of info from the commandline that
would indicate what the problem is. Previous version 1.4 was at least
indicating there was a problem connecting via ssl, so I found some posts
indicating the problem might be tls, hence I upgraded hoping this issue was
resolved, but, apparently not?
All I'm getting for errors is:
fixme:imm:NotifyIME IMC_SETCANDIDATEPOS
fixme:imm:ImmReleaseContext (0x2002a, 0x3e52fb8): stub
fixme:win:FlashWindowEx 0x33c944
fixme:win:FlashWindowEx 0x33cc14
fixme:win:FlashWindowEx 0x33d314
fixme:win:FlashWindowEx 0x33c944
fixme:win:FlashWindowEx 0x33ccd4
fixme:imm:NotifyIME IMC_SETCANDIDATEPOS
fixme:imm:NotifyIME IMC_SETCANDIDATEPOS
fixme:win:FlashWindowEx 0x33c9e4
fixme:winsock:WSAIoctl WS_SIO_UDP_CONNRESET stub
Any clues for me? :)
--
Configure bugmail: http://bugs.winehq.org/userprefs.cgi?tab=email
Do not reply to this email, post in Bugzilla using the
above URL to reply.
------- You are receiving this mail because: -------
You are watching all bug changes.
https://bugs.winehq.org/show_bug.cgi?id=44478
Bug ID: 44478
Summary: Wine returns to home screen on S5
Product: Wine
Version: 3.1
Hardware: arm
OS: Android
Status: UNCONFIRMED
Severity: normal
Priority: P2
Component: -unknown
Assignee: wine-bugs(a)winehq.org
Reporter: jnskeer(a)gmail.com
I can install Wine and have it unpack on my Samsung S5, but as soon as it
unpacks it minimizes the app and returns to the Android home screen. Every
attempt to reopen the Wine app rotates the screen to landscape, minimizes Wine,
and rotates it back to portrait mode.
This isn't the first app to not work right on my S5. I tried the Boardwalk app,
and apparently they stopped supporting Samsung due to some sort of security
issue messing with app compatiblity or something. Wine and Boardwalk works on
my ZTE phone.
--
Do not reply to this email, post in Bugzilla using the
above URL to reply.
You are receiving this mail because:
You are watching all bug changes.
https://bugs.winehq.org/show_bug.cgi?id=45063
Bug ID: 45063
Summary: win64 / 64-bit .NET 4.0 - c0000005 from
ntdll:RtlGetDaclSecurityDescriptor
Product: Wine
Version: 3.6
Hardware: x86-64
OS: Mac OS X
Status: UNCONFIRMED
Severity: normal
Priority: P2
Component: ntdll
Assignee: wine-bugs(a)winehq.org
Reporter: pembertona(a)gmail.com
After fighting for some to get .NET 4.0 running on 64 bit (great progress here
after overcoming multiple msi/msiexec/installer issues), I've hit an access
violation exception running a very basic 'hello world' 64-bit console app. This
is on `portable-winehq-staging-3.6-osx64` - but almost certainly the devel and
stable branches as well.
136984.882:0008:0041:Call
advapi32.ConvertStringSecurityDescriptorToSecurityDescriptorW(19e1f7f8
L"D:P(A;;GRGW;;;BA)(A;;GRGW;;;S-1-5-21-0-0-0-1000)",00000001,19e1f780,19e1f7c8)
ret=6447f2c4d3e
136984.884:0008:0041:trace:advapi:ConvertStringSecurityDescriptorToSecurityDescriptorW
L"D:P(A;;GRGW;;;BA)(A;;GRGW;;;S-1-5-21-0-0-0-1000)", 1, 0x19e1f780, 0x19e1f7c8
136984.884:0008:0041:trace:heap:RtlAllocateHeap (0x10000,70000062,00000062):
returning 0xf60b0
136984.885:0008:0041:trace:advapi:ParseStringAclToAcl
L"P(A;;GRGW;;;BA)(A;;GRGW;;;S-1-5-21-0-0-0-1000)"
136984.885:0008:0041:trace:advapi:ParseStringSidToSid
L"BA)(A;;GRGW;;;S-1-5-21-0-0-0-1000)", 0x0, 0x19e1f514
136984.885:0008:0041:trace:advapi:ParseStringSidToSid only size requested,
returning TRUE with 16
136984.885:0008:0041:trace:advapi:ParseStringSidToSid L"S-1-5-21-0-0-0-1000)",
0x0, 0x19e1f514
136984.885:0008:0041:trace:advapi:ParseStringSidToSid only size requested,
returning TRUE with 28
136984.885:0008:0041:trace:heap:RtlFreeHeap (0x10000,70000062,0xf60b0):
returning TRUE
136984.886:0008:0041:trace:heap:RtlAllocateHeap (0x10000,7000006a,00000058):
returning 0x46340
136984.886:0008:0041:trace:heap:LocalAlloc (flags=0040) returning 0x46340
136984.886:0008:0041:trace:heap:RtlAllocateHeap (0x10000,70000062,00000062):
returning 0x46420
136984.886:0008:0041:trace:advapi:ParseStringAclToAcl
L"P(A;;GRGW;;;BA)(A;;GRGW;;;S-1-5-21-0-0-0-1000)"
136984.886:0008:0041:trace:advapi:ParseStringSidToSid
L"BA)(A;;GRGW;;;S-1-5-21-0-0-0-1000)", 0x46364, 0x19e1f514
136984.886:0008:0041:trace:advapi:ParseStringSidToSid returning TRUE
136984.886:0008:0041:trace:advapi:ParseStringSidToSid L"S-1-5-21-0-0-0-1000)",
0x4637c, 0x19e1f514
136984.886:0008:0041:trace:advapi:ParseStringSidToSid returning TRUE
136984.887:0008:0041:trace:heap:RtlFreeHeap (0x10000,70000062,0x46420):
returning TRUE
136984.887:0008:0041:trace:advapi:ConvertStringSecurityDescriptorToSecurityDescriptorW
ret=1
136984.887:0008:0041:Ret
advapi32.ConvertStringSecurityDescriptorToSecurityDescriptorW() retval=00000001
ret=6447f2c4d3e
136984.887:0008:0041:Call ntdll.RtlFreeHeap(00010000,00000000,000f5f30)
ret=6447f2c4dc8
136984.887:0008:0041:trace:heap:RtlFreeHeap (0x10000,70000062,0xf5f30):
returning TRUE
136984.887:0008:0041:Ret ntdll.RtlFreeHeap() retval=00000001 ret=6447f2c4dc8
136984.887:0008:0041:trace:ntdll:RtlGetSaclSecurityDescriptor
(0x46340,0x19e1f716,0x19e1f718,0x19e1f715)
136984.887:0008:0041:trace:ntdll:RtlGetDaclSecurityDescriptor
(0x46340,0x19e1f717,0x19e1f720,0x19e1f715)
136984.887:0008:0041:trace:heap:RtlAllocateHeap (0x10000,7000006a,0000009c):
returning 0x46570
136984.888:0008:0041:trace:heap:RtlFreeHeap (0x10000,70000062,0x46570):
returning TRUE
136984.888:0008:0041:trace:seh:NtRaiseException code=c0000005 flags=0
addr=0x6447f1d6f19 ip=6447f1d6f19 tid=0041
136984.888:0008:0041:trace:seh:NtRaiseException info[0]=0000000000000000
136984.888:0008:0041:trace:seh:NtRaiseException info[1]=0000000000000010
136984.888:0008:0041:trace:seh:NtRaiseException rax=0000000000000000
rbx=000006447f27fd30 rcx=0000000019e1fce0 rdx=0000000019e21ad0
136984.888:0008:0041:trace:seh:NtRaiseException rsi=0000000019e1fce0
rdi=0000000000000000 rbp=0000000019e1fe00 rsp=0000000019e1fc20
136984.888:0008:0041:trace:seh:NtRaiseException r8=0000000019e1f298
r9=0000000000000010 r10=0000000019e21b25 r11=ffffffffffffffa9
136984.888:0008:0041:trace:seh:NtRaiseException r12=0000000000000000
r13=0000000000000000 r14=0000000000044860 r15=0000000000000000
136984.888:0008:0041:trace:seh:call_vectored_handlers calling handler at
0x6447f30a954 code=c0000005 flags=0
...
136984.967:0008:0041:err:eventlog:ReportEventW L"Application:
Console64.exe\nFramework Version: v4.0.30319\nDescription: The process was
terminated due to an internal error in the .NET Runtime at IP 000006447F1D6F19
(000006447F100000) with exit code 80131506.\n"
Possibly related to https://bugs.winehq.org/show_bug.cgi?id=27680?
--
Do not reply to this email, post in Bugzilla using the
above URL to reply.
You are receiving this mail because:
You are watching all bug changes.
http://bugs.winehq.org/show_bug.cgi?id=34296
Bug #: 34296
Summary: wine --help message should be translatable
Product: Wine
Version: 1.7.0
Platform: x86-64
OS/Version: Linux
Status: NEW
Keywords: download, source
Severity: normal
Priority: P2
Component: loader
AssignedTo: wine-bugs(a)winehq.org
ReportedBy: frederic.delanoy(a)gmail.com
Classification: Unclassified
It's currently hardcoded in loader/main.c (check_command_line function)
static const char usage[] =
"Usage: wine PROGRAM [ARGUMENTS...] Run the specified program\n"
" wine --help Display this help and exit\n"
" wine --version Output version information and
exit";
--
Configure bugmail: http://bugs.winehq.org/userprefs.cgi?tab=email
Do not reply to this email, post in Bugzilla using the
above URL to reply.
------- You are receiving this mail because: -------
You are watching all bug changes.
http://bugs.winehq.org/show_bug.cgi?id=33774
Bug #: 33774
Summary: Text clipped in some translated touhou games
Product: Wine
Version: unspecified
Platform: x86-64
OS/Version: Linux
Status: UNCONFIRMED
Severity: minor
Priority: P2
Component: -unknown
AssignedTo: wine-bugs(a)winehq.org
ReportedBy: murela_alba(a)abv.bg
Classification: Unclassified
Created attachment 44734
--> http://bugs.winehq.org/attachment.cgi?id=44734
Touhou 13 music room
Noticed this in a few of the touhou games, where the main font has a different
weight and possibly different horizontal dimensions. This sometimes leads to
text going out of the textbox and getting clipped, like in this screenshot from
the touhou 13 music room.
Wine version is 1.5.31 on Ubuntu 13.04 (64-bit), though the same happens with
1.4.1 as well. The other screencap is from Windows 7.
--
Configure bugmail: http://bugs.winehq.org/userprefs.cgi?tab=email
Do not reply to this email, post in Bugzilla using the
above URL to reply.
------- You are receiving this mail because: -------
You are watching all bug changes.
https://bugs.winehq.org/show_bug.cgi?id=41360
Bug ID: 41360
Summary: can not display english
Product: Wine
Version: 1.9.19
Hardware: x86
OS: Linux
Status: UNCONFIRMED
Severity: normal
Priority: P2
Component: -unknown
Assignee: wine-bugs(a)winehq.org
Reporter: 1934337507a(a)gmail.com
Distribution: ---
Created attachment 55712
--> https://bugs.winehq.org/attachment.cgi?id=55712
This is the picture of uninstaller.exe runs in wine.
The wine program uninstaller.exe can display chinese,but can't display english.
--
Do not reply to this email, post in Bugzilla using the
above URL to reply.
You are receiving this mail because:
You are watching all bug changes.
https://bugs.winehq.org/show_bug.cgi?id=42882
Bug ID: 42882
Summary: rs232 port access no working with ubuntu 17.10 worked
fine with previous versions of ubuntu
Product: Wine
Version: 2.4
Hardware: x86-64
OS: Linux
Status: UNCONFIRMED
Severity: blocker
Priority: P2
Component: -unknown
Assignee: wine-bugs(a)winehq.org
Reporter: arcadeshopper(a)gmail.com
Distribution: ---
I am able to connect to the serial port via applications in wine but there is
never any data received.
I can communicate outside of wine without issue using minicom.
I am using a ftdi usb to serial adapter that worked fine in previous versions
of ubuntu. I am having this problems with all relases of wine I have tried
including the default ubuntu package and 2.4 from the PPA
--
Do not reply to this email, post in Bugzilla using the
above URL to reply.
You are receiving this mail because:
You are watching all bug changes.
https://bugs.winehq.org/show_bug.cgi?id=37382
Bug ID: 37382
Summary: Kyonyuu fantajii:A adult adventure games can install
games but cannot start
Product: Wine
Version: 1.7.28
Hardware: x86-64
OS: Linux
Status: UNCONFIRMED
Severity: normal
Priority: P2
Component: -unknown
Assignee: wine-bugs(a)winehq.org
Reporter: kddc3s(a)gmail.com
Created attachment 49716
--> https://bugs.winehq.org/attachment.cgi?id=49716
Console messages when starting the game
The day before yesterday I updated wine 1.7.28 can't run ,but original wine
1.7.27 was still work. I re-install the game and recover to wine 1.7.27 was
still can't work.
--
Do not reply to this email, post in Bugzilla using the
above URL to reply.
You are receiving this mail because:
You are watching all bug changes.
http://bugs.winehq.org/show_bug.cgi?id=22740
Summary: Lifbase freezes when minimized
Product: Wine
Version: 1.1.44
Platform: x86
URL: http://www.sri.com/psd/lifbase/
OS/Version: Linux
Status: UNCONFIRMED
Severity: normal
Priority: P2
Component: -unknown
AssignedTo: wine-bugs(a)winehq.org
ReportedBy: drakkk(a)centrum.cz
Created an attachment (id=28035)
--> (http://bugs.winehq.org/attachment.cgi?id=28035)
terminal output
When I minimize lifbase there is an error window "Runtime Error '380' Invalid
property value" with OK button. But OK button doesn't respond to mouse click,
program becomes unresponsive and must be manually killed.
--
Configure bugmail: http://bugs.winehq.org/userprefs.cgi?tab=email
Do not reply to this email, post in Bugzilla using the
above URL to reply.
------- You are receiving this mail because: -------
You are watching all bug changes.
http://bugs.winehq.org/show_bug.cgi?id=24354
Summary: Webtrends Log Analyzer 6.5c : cannot write BMP files
to disk
Product: Wine
Version: 1.2
Platform: x86
OS/Version: Linux
Status: UNCONFIRMED
Severity: normal
Priority: P2
Component: -unknown
AssignedTo: wine-bugs(a)winehq.org
ReportedBy: chris(a)apex-internet.com
Installed Webtrends Log Analyzer 6.5 which works fine, then created a new
profile which also works fine. The problem is when trying to create a new
Report for a profile, it is able to read the web server logs OK, but errors out
when it starts to generate the report to write to disk. The error reported in
Webtrends is:
Unable to extract bmpinfo (using VIC32.DL) from file "C:\Program
Files\WebTrends Log Analyzer\reports\Web
Analysis\TempGraphFiles\ms-2010-0800.bmp"
This BMP file is created, but it is zero bytes in size. At the same time that
this error occurs in Webtrends, in the bash terminal Wine is reporting this
error:
fixme:ole:OLEPictureImpl_SaveAsFile (0x1011dd8)->(0x1017db0, 1, 0x2efde0),
hacked stub.
Here's a link for the Webtrends 6.5c demo:
http://www.tucows.com/preview/195171
--
Configure bugmail: http://bugs.winehq.org/userprefs.cgi?tab=email
Do not reply to this email, post in Bugzilla using the
above URL to reply.
------- You are receiving this mail because: -------
You are watching all bug changes.
https://bugs.winehq.org/show_bug.cgi?id=43768
Bug ID: 43768
Summary: crash game
Product: Wine-staging
Version: 2.17
Hardware: x86-64
OS: Linux
Status: UNCONFIRMED
Severity: critical
Priority: P2
Component: -unknown
Assignee: wine-bugs(a)winehq.org
Reporter: paolinidiego(a)gmail.com
CC: erich.e.hoover(a)wine-staging.com, michael(a)fds-team.de,
sebastian(a)fds-team.de
Distribution: ---
Created attachment 59271
--> https://bugs.winehq.org/attachment.cgi?id=59271
log
crash while loading the character.
--
Do not reply to this email, post in Bugzilla using the
above URL to reply.
You are receiving this mail because:
You are watching all bug changes.
https://bugs.winehq.org/show_bug.cgi?id=45058
Bug ID: 45058
Summary: Neverwinter Nights GOG installer failure
Product: Wine
Version: 3.5
Hardware: x86
OS: Linux
Status: UNCONFIRMED
Severity: normal
Priority: P2
Component: comctl32
Assignee: wine-bugs(a)winehq.org
Reporter: bronsonmathews(a)gmail.com
Distribution: ---
GOG version of Neverwinter Nights Diamond Edition installer fails to run.
Looks possibly like a comctl32 issue?
Log here:
https://pastebin.com/
--
Do not reply to this email, post in Bugzilla using the
above URL to reply.
You are receiving this mail because:
You are watching all bug changes.
https://bugs.winehq.org/show_bug.cgi?id=48608
Bug ID: 48608
Summary: Kotor 2 crsahes when starting a new game/loading a new
game
Product: Wine
Version: 5.0
Hardware: x86
OS: Linux
Status: UNCONFIRMED
Severity: normal
Priority: P2
Component: -unknown
Assignee: wine-bugs(a)winehq.org
Reporter: bgracer2010(a)gmail.com
Distribution: ---
Created attachment 66448
--> https://bugs.winehq.org/attachment.cgi?id=66448
Logs from wine
Game installs and runs normally through character creation and showing intro
movie. After the fact it crashes.
--
Do not reply to this email, post in Bugzilla using the
above URL to reply.
You are receiving this mail because:
You are watching all bug changes.
https://bugs.winehq.org/show_bug.cgi?id=45534
Bug ID: 45534
Summary: Right after my first battle with Damien in Pokemon
Insurgence, it says that Game exe has stopped working
and there may be an issue in wine
Product: Wine
Version: unspecified
Hardware: x86
OS: Linux
Status: UNCONFIRMED
Severity: blocker
Priority: P2
Component: -unknown
Assignee: wine-bugs(a)winehq.org
Reporter: viyengar105(a)gmail.com
Distribution: ---
Created attachment 61937
--> https://bugs.winehq.org/attachment.cgi?id=61937
A picture of what the error is and what is says
The image of the error is in the attachment
--
Do not reply to this email, post in Bugzilla using the
above URL to reply.
You are receiving this mail because:
You are watching all bug changes.
https://bugs.winehq.org/show_bug.cgi?id=39983
Bug ID: 39983
Summary: wine cannot work in any version, possibly the reason
for graphics card driver
Product: Wine
Version: 1.9.1
Hardware: x86-64
OS: Linux
Status: UNCONFIRMED
Severity: normal
Priority: P2
Component: -unknown
Assignee: wine-bugs(a)winehq.org
Reporter: chxp_moon(a)163.com
Distribution: ---
Created attachment 53423
--> https://bugs.winehq.org/attachment.cgi?id=53423
start winecfg after install wine
I first install ubuntu 14.04 on my new computer, if I update ubuntu before I
install wine1.6 (sudo apt-get install wine1.6), it show wine1.6 depends on
wine1.6-i386 (sudo apt-get install wine1.6-i386) and it cannot install, when I
install wine1.6-i386, it show wine1.6-i386 depends on wine1.4 and so on ...
(when I install xorg-edgers, I can install wine1.6 or wine1.8 (sudo apt-get
install wine1.6), however, the problem mention following still exist.)
Furhter, I reinstall the ubuntu 14.04 and install wine before I update the
systems. Wine1.6 is installed, however, when I start winecfg it show the error
of 'gdi32' error (see attachment).
I tried the wine1.8 and wine1.9.1 and also tried the ubuntu15.10, winecfg never
correctly started. And I also compile the 1.6 and 1.8 from source, it compile
right but cannot correctly started with same error.
I doubt the driver of my computer or some library of drive corrupt with wine.
my system and my computer information is here:
I using ubuntu 15.10 newly. The Graphic system: Intel® HD Graphics 5300
(Broadwell GT2) .
I think mesa library may corrupt with wine?
> uname -a
Linux UX305FA 4.2.0-22-generic #27-Ubuntu SMP Thu Dec 17 22:57:08 UTC 2015
x86_64 x86_64 x86_64 GNU/Linux
> cat /proc/version
Linux version 4.2.0-22-generic (buildd@lcy01-22) (gcc version 5.2.1 20151010
(Ubuntu 5.2.1-22ubuntu2) ) #27-Ubuntu SMP Thu Dec 17 22:57:08 UTC 2015
> lspci
00:00.0 Host bridge: Intel Corporation Broadwell-U Host Bridge -OPI (rev 09)
00:02.0 VGA compatible controller: Intel Corporation Broadwell-U Integrated
Graphics (rev 09)
00:03.0 Audio device: Intel Corporation Broadwell-U Audio Controller (rev 09)
00:04.0 Signal processing controller: Intel Corporation Broadwell-U Camarillo
Device (rev 09)
00:14.0 USB controller: Intel Corporation Wildcat Point-LP USB xHCI Controller
(rev 03)
00:16.0 Communication controller: Intel Corporation Wildcat Point-LP MEI
Controller #1 (rev 03)
00:1b.0 Audio device: Intel Corporation Wildcat Point-LP High Definition Audio
Controller (rev 03)
00:1c.0 PCI bridge: Intel Corporation Wildcat Point-LP PCI Express Root Port #1
(rev e3)
00:1c.3 PCI bridge: Intel Corporation Wildcat Point-LP PCI Express Root Port #4
(rev e3)
00:1f.0 ISA bridge: Intel Corporation Wildcat Point-LP LPC Controller (rev 03)
00:1f.2 SATA controller: Intel Corporation Wildcat Point-LP SATA Controller
[AHCI Mode] (rev 03)
00:1f.3 SMBus: Intel Corporation Wildcat Point-LP SMBus Controller (rev 03)
02:00.0 Network controller: Intel Corporation Wireless 7265 (rev 59)
> hwinfo --short
cpu:
Intel(R) Core(TM) M-5Y71 CPU @ 1.20GHz, 2600 MHz
Intel(R) Core(TM) M-5Y71 CPU @ 1.20GHz, 2683 MHz
Intel(R) Core(TM) M-5Y71 CPU @ 1.20GHz, 2600 MHz
Intel(R) Core(TM) M-5Y71 CPU @ 1.20GHz, 2788 MHz
graphics card:
Intel VGA compatible controller
sound:
Intel Audio device
Intel Audio device
storage:
Intel SATA controller
network:
wlan0 Intel WLAN controller
network interface:
lo Loopback network interface
wlan0 WLAN network interface
disk:
/dev/sda SanDisk SD7SN3Q5
bios:
BIOS
bridge:
Intel Host bridge
Intel PCI bridge
Intel PCI bridge
Intel ISA bridge
hub:
Linux 4.2.0-22-generic xhci-hcd xHCI Host Controller
Linux 4.2.0-22-generic xhci-hcd xHCI Host Controller
--
Do not reply to this email, post in Bugzilla using the
above URL to reply.
You are receiving this mail because:
You are watching all bug changes.
https://bugs.winehq.org/show_bug.cgi?id=42430
Bug ID: 42430
Summary: Page fault on read access to 0x78c000bd in 32-bit code
when loading .Net application
Product: Wine
Version: 2.1
Hardware: x86-64
OS: Linux
Status: UNCONFIRMED
Severity: normal
Priority: P2
Component: -unknown
Assignee: wine-bugs(a)winehq.org
Reporter: franknleslie(a)gmail.com
Distribution: ---
Created attachment 57261
--> https://bugs.winehq.org/attachment.cgi?id=57261
GarminExpressInstaller backtrace 1
When trying to execute GarminExpressInstaller.exe I run into a page fault
exception as the installer window is opening.
Environment:
openSUSE Tumbleweed x86_64
kernel 4.9.8-1-default
wine 2.1
Initially when the installer was launching I was receiving the following error:
fixme:win:EnumDisplayDevicesW ((null),0,0x6c1e414,0x00000000), stub!
fixme:win:EnumDisplayDevicesW ((null),0,0x6c1e528,0x00000000), stub!
fixme:win:EnumDisplayDevicesW ((null),1,0x6c1e528,0x00000000), stub!
fixme:d3d:wined3d_guess_card No card selector available for card vendor 0000
(using GL_RENDERER "Gallium 0.4 on llvmpipe (LLVM 3.9, 128 bits)").
I resolved that by installing Mesa-dri-nouveau-32bit (since I have a NVidia
video card).
After restarting the application I am now receiving the following unhandled
exception:
fixme:win:EnumDisplayDevicesW ((null),0,0x6c1e414,0x00000000), stub!
fixme:win:EnumDisplayDevicesW ((null),0,0x6c1e528,0x00000000), stub!
fixme:win:EnumDisplayDevicesW ((null),1,0x6c1e528,0x00000000), stub!
fixme:win:EnumDisplayDevicesW ((null),0,0x6c1e414,0x00000000), stub!
fixme:win:EnumDisplayDevicesW ((null),0,0x6c1e528,0x00000000), stub!
fixme:win:EnumDisplayDevicesW ((null),1,0x6c1e528,0x00000000), stub!
fixme:win:EnumDisplayDevicesW ((null),0,0x6c1e414,0x00000000), stub!
fixme:win:EnumDisplayDevicesW ((null),0,0x6c1e528,0x00000000), stub!
fixme:win:EnumDisplayDevicesW ((null),1,0x6c1e528,0x00000000), stub!
fixme:advapi:RegisterEventSourceW ((null),L".NET Runtime"): stub
fixme:advapi:ReportEventW
(0xcafe4242,0x0001,0x0000,0x00000402,(nil),0x0001,0x00000000,0x6c1c920,(nil)):
stub
err:eventlog:ReportEventW L"Application: GarminExpressInstaller.exe\nFramework
Version: v4.0.30319\nDescription: The process was terminated due to an
unhandled exception.\nException Info: exception code c0000005, exception
address 7CB686E3\n"
fixme:advapi:DeregisterEventSource (0xcafe4242) stub
wine: Unhandled page fault on read access to 0x78c000bd at address 0x7cb686e3
(thread 0044), starting debugger...
fixme:thread:NtQueryInformationThread info class 16 not supported yet
fixme:service:QueryServiceConfig2W Level 6 not implemented
I have attached the backtrace to this bug.
--
Do not reply to this email, post in Bugzilla using the
above URL to reply.
You are receiving this mail because:
You are watching all bug changes.
https://bugs.winehq.org/show_bug.cgi?id=46217
Bug ID: 46217
Summary: crashes when extracting a zip archive
Product: Wine
Version: 3.21
Hardware: x86
OS: Linux
Status: UNCONFIRMED
Severity: normal
Priority: P2
Component: -unknown
Assignee: wine-bugs(a)winehq.org
Reporter: nickyradwal1609(a)gmail.com
Distribution: ---
when i download any game like PUBG or gta vice city it couldnot download
--
Do not reply to this email, post in Bugzilla using the
above URL to reply.
You are receiving this mail because:
You are watching all bug changes.
https://bugs.winehq.org/show_bug.cgi?id=39046
Bug ID: 39046
Summary: Implement User Mode Driver Framework
Product: Wine
Version: unspecified
Hardware: x86
OS: Linux
Status: UNCONFIRMED
Severity: normal
Priority: P2
Component: -unknown
Assignee: wine-bugs(a)winehq.org
Reporter: jxkxpnd(a)mailforspam.com
Distribution: ---
UMDF allows developers to write drivers hosted as usermode processes.
https://msdn.microsoft.com/en-us/library/windows/hardware/dn384105.aspx
--
Do not reply to this email, post in Bugzilla using the
above URL to reply.
You are receiving this mail because:
You are watching all bug changes.
https://bugs.winehq.org/show_bug.cgi?id=43982
Bug ID: 43982
Summary: Pokemon insurgence keeps on crashing once I finish a
battle or catch a pokemon. Plz contact the team that
made the game.
Product: Wine
Version: unspecified
Hardware: Other
OS: Mac OS X
Status: UNCONFIRMED
Severity: normal
Priority: P2
Component: -unknown
Assignee: wine-bugs(a)winehq.org
Reporter: ryanflorio2(a)gmail.com
Pokemon insurgence crashing after every battle or when I receive mystery gift.
--
Do not reply to this email, post in Bugzilla using the
above URL to reply.
You are receiving this mail because:
You are watching all bug changes.
https://bugs.winehq.org/show_bug.cgi?id=48117
Bug ID: 48117
Summary: Scarlet Blade Can not start game (launcher)
Product: Wine
Version: 4.0
Hardware: x86-64
OS: Linux
Status: UNCONFIRMED
Severity: blocker
Priority: P2
Component: -unknown
Assignee: wine-bugs(a)winehq.org
Reporter: pre_drag_ovic(a)yahoo.com
Distribution: ---
Created attachment 65711
--> https://bugs.winehq.org/attachment.cgi?id=65711
screenshot of bug
When I press "start" button nothing happens.
https://sb.vendettagn.com/download.vgn
FTP, there may be alternate cdns. This one is official.
--
Do not reply to this email, post in Bugzilla using the
above URL to reply.
You are receiving this mail because:
You are watching all bug changes.
https://bugs.winehq.org/show_bug.cgi?id=48005
Bug ID: 48005
Summary: Dynamic Auto Painter MacAir crashes
Product: WineHQ Bugzilla
Version: unspecified
Hardware: x86
OS: Linux
Status: UNCONFIRMED
Severity: normal
Priority: P2
Component: bugzilla-unknown
Assignee: wine-bugs(a)winehq.org
Reporter: haemengine(a)yahoo.co.uk
CC: austinenglish(a)gmail.com
Distribution: ---
Using Dynamic Auto Painter on a Mac Air to photopaint a picture (D'Orcia
filter) consistently causes a crash when starting the detailed paint phase of
the program.
C:\Program Files\DAPPRO05\DaPainter32.exe
""This application has requested the Runtime to terminate in an unusual way.
Please contact the application's support team for more information.
--
Do not reply to this email, post in Bugzilla using the
above URL to reply.
You are receiving this mail because:
You are watching all bug changes.
https://bugs.winehq.org/show_bug.cgi?id=37193
Bug ID: 37193
Summary: Behaviour of all software by (only on) HDMI monitors
by extruted desktopn of laptop
Product: Wine
Version: unspecified
Hardware: x86
OS: Linux
Status: UNCONFIRMED
Severity: normal
Priority: P2
Component: -unknown
Assignee: wine-bugs(a)winehq.org
Reporter: tothsoft(a)gmail.com
Behaviour of all software by HDMI monitors by extruted desktop of laptop. All
applications are delimited on second (hdmi) monitor.
On laptop is still all ok. Also by using of vga connector for connection of
second monitor, is also all ok.
Delimited using: impossibility work with. e.g.: ms office 2007, pdf xchange.
My current wine is 1.7.22 , ..and i use last playonlinux.
--
Do not reply to this email, post in Bugzilla using the
above URL to reply.
You are receiving this mail because:
You are watching all bug changes.
https://bugs.winehq.org/show_bug.cgi?id=46367
Bug ID: 46367
Summary: Visual Basic Game has "Run-time error 91"
Product: Wine
Version: 4.0-rc1
Hardware: x86
OS: Linux
Status: UNCONFIRMED
Severity: normal
Priority: P2
Component: -unknown
Assignee: wine-bugs(a)winehq.org
Reporter: alexterranova81(a)gmail.com
Distribution: ---
When trying to run a visual basic game there's a "Run-time error 91"
Homepage for the game: https://jrmus.webcindario.com/jrtute.html
Link to game: https://app.box.com/s/l9byadx2cknjq4gvz7cx (It's free and legal)
The game requires a dll: Msvbvm50.dll
Logs: https://www.pastiebin.com/5c22cd45a912c
--
Do not reply to this email, post in Bugzilla using the
above URL to reply.
You are receiving this mail because:
You are watching all bug changes.
https://bugs.winehq.org/show_bug.cgi?id=44721
Bug ID: 44721
Summary: GetFullPathName return path
Product: Wine
Version: 3.3
Hardware: x86
OS: Linux
Status: UNCONFIRMED
Severity: normal
Priority: P2
Component: kernel32
Assignee: wine-bugs(a)winehq.org
Reporter: markau0(a)lycos.com
Distribution: ---
I ran the GetFullPathName code example from the Microsoft site
https://msdn.microsoft.com/en-us/library/windows/desktop/aa364963(v=vs.85).…
and Vista returns
The full path name is: c:\windows\notepad.exe
The short name for c:\longdirectoryname is c:\LONGDI~1
The long name for c:\LONGDI~1 is c:\longdirectoryname
and Wine 3.3 returns
The full path name is: c:\windowsnotepad.exe
The short name for c:\longdirectoryname is c:\LONG~TX4
The long name for c:\LONG~TX4 is c:\longdirectoryname
The full path name is: c:\windows\notepad.exe
The full path name is: c:\windowsnotepad.exe
do not seem to match.
--
Do not reply to this email, post in Bugzilla using the
above URL to reply.
You are receiving this mail because:
You are watching all bug changes.
https://bugs.winehq.org/show_bug.cgi?id=48299
Bug ID: 48299
Summary: GAMES CRASH WHEN RUN WITH TRAINERS
Product: Wine
Version: unspecified
Hardware: x86
OS: Linux
Status: UNCONFIRMED
Severity: normal
Priority: P2
Component: -unknown
Assignee: wine-bugs(a)winehq.org
Reporter: chakravarthy918(a)gmail.com
Distribution: ---
i was playing some old games like MAX PAYNE 1 AND IGI 1 AND 2(MY LAPTOP IS A
COMPLETE TRASH). i finished everything so i tried to use some mods using
trainers.i downloaded some and ran it using wine. but inside the game (i mean
after started playing the game) if i tried to pause the game or press the
buttons to activate the trainers it just crashes. IGI 1 works perfect(with
trainer on) but MAX PAYNE and IGI 2 crashes instantly
I think i am using an older version of wine (again my laptop is a potato one
and the OS i have is a ancient one [14.04 LTS] an old i3 with 2 GB ram)
--
Do not reply to this email, post in Bugzilla using the
above URL to reply.
You are receiving this mail because:
You are watching all bug changes.
https://bugs.winehq.org/show_bug.cgi?id=43646
Bug ID: 43646
Summary: Wine Viewer keeps freezing up
Product: Wine
Version: unspecified
Hardware: Other
OS: Mac OS X
Status: UNCONFIRMED
Severity: normal
Priority: P2
Component: -unknown
Assignee: wine-bugs(a)winehq.org
Reporter: synctuarie(a)protonmail.com
Created attachment 59071
--> https://bugs.winehq.org/attachment.cgi?id=59071
Freeze Bug
Viewer keeps freezing up.
--
Do not reply to this email, post in Bugzilla using the
above URL to reply.
You are receiving this mail because:
You are watching all bug changes.
https://bugs.winehq.org/show_bug.cgi?id=46462
Bug ID: 46462
Summary: Drop fps
Product: Wine
Version: 4.0-rc6
Hardware: x86-64
OS: Linux
Status: UNCONFIRMED
Severity: normal
Priority: P2
Component: -unknown
Assignee: wine-bugs(a)winehq.org
Reporter: mietkong(a)gmail.com
Distribution: ---
Hi When im playing elder scrolls oblivion fps drops down to 5-10 fps only when
i moving mouse . If mouse is not moving fps is high how to solve this
--
Do not reply to this email, post in Bugzilla using the
above URL to reply.
You are receiving this mail because:
You are watching all bug changes.
https://bugs.winehq.org/show_bug.cgi?id=45300
Bug ID: 45300
Summary: Eviews 10SV: Crashes when performing ADF test on time
series
Product: Wine
Version: unspecified
Hardware: x86-64
OS: Mac OS X
Status: UNCONFIRMED
Severity: major
Priority: P2
Component: -unknown
Assignee: wine-bugs(a)winehq.org
Reporter: ga.carvajal10(a)uniandes.edu.co
Created attachment 61560
--> https://bugs.winehq.org/attachment.cgi?id=61560
Backtrace of Eviews 10SV
Whenever I try to run an augmented Dickey-Fuller test on a time series, the
program crashes an says Eviews10SV.exe must be closed. I'm on a MacBook Pro 15'
TouchBar with the OS up to date and the program is also on the latest version.
The problem started earlier today after an update to Eviews 10SV, which the
program informed by its automatic updates service. Right now I have installed
Wviews10SV Jun 4 2018 Build.
--
Do not reply to this email, post in Bugzilla using the
above URL to reply.
You are receiving this mail because:
You are watching all bug changes.
http://bugs.winehq.org/show_bug.cgi?id=33658
Bug #: 33658
Summary: Warcraft 3: Crash on missing sound permissions
Product: Wine
Version: 1.5.30
Platform: x86-64
OS/Version: Linux
Status: UNCONFIRMED
Severity: normal
Priority: P2
Component: -unknown
AssignedTo: wine-bugs(a)winehq.org
ReportedBy: sworddragon2(a)aol.com
Classification: Unclassified
Created attachment 44555
--> http://bugs.winehq.org/attachment.cgi?id=44555
Crash if no sound is available
If I'm not having the permissions as the audio group Warcraft 3 will crash if
it starts (after the splash screen appeared). Adding my account to the audio
group solves the problem. In the attachments is a log of such a crash.
--
Configure bugmail: http://bugs.winehq.org/userprefs.cgi?tab=email
Do not reply to this email, post in Bugzilla using the
above URL to reply.
------- You are receiving this mail because: -------
You are watching all bug changes.
https://bugs.winehq.org/show_bug.cgi?id=48281
Bug ID: 48281
Summary: installing wine 4.21 ./configure
Product: Packaging
Version: unspecified
Hardware: x86
OS: Linux
Status: UNCONFIRMED
Severity: normal
Priority: P2
Component: wine-packages
Assignee: wine-bugs(a)winehq.org
Reporter: adriandonraadt(a)gmail.com
CC: dimesio(a)earthlink.net, michael(a)fds-team.de,
sebastian(a)fds-team.de
Distribution: ---
Created attachment 65962
--> https://bugs.winehq.org/attachment.cgi?id=65962
install errors
see attachment
--
Do not reply to this email, post in Bugzilla using the
above URL to reply.
You are receiving this mail because:
You are watching all bug changes.
https://bugs.winehq.org/show_bug.cgi?id=48522
Bug ID: 48522
Summary: ME:Andromeda scanner doesnt react on objects
Product: Wine
Version: 5.0
Hardware: x86-64
OS: Linux
Status: UNCONFIRMED
Severity: normal
Priority: P2
Component: -unknown
Assignee: wine-bugs(a)winehq.org
Reporter: timofeevsv1989(a)gmail.com
Distribution: ---
It is strange regression.
Scanner in Mass Effect Andromeda doesnt react on every scannable objects (which
orange)
I can open scanner, but click doesnt do anything.
I've also tried bind another keys and buttons on scan -- it does do anything...
It makes game broken
--
Do not reply to this email, post in Bugzilla using the
above URL to reply.
You are receiving this mail because:
You are watching all bug changes.
https://bugs.winehq.org/show_bug.cgi?id=47211
Bug ID: 47211
Summary: Crash on launching Anno 1800 with
tkg-protonified-4.6-x86_64
Product: Wine
Version: unspecified
Hardware: x86
OS: Linux
Status: UNCONFIRMED
Severity: normal
Priority: P2
Component: -unknown
Assignee: wine-bugs(a)winehq.org
Reporter: jonasmarx(a)posteo.de
Distribution: ---
Created attachment 64479
--> https://bugs.winehq.org/attachment.cgi?id=64479
Backtrace of error
Hello!
Im not sure if this is the right place - but i thought i might share this error
backtrace with you in case it helps. :)
Im using lutris -> uplay (offline mode, ingame windows disabled) and get the
following error on launch (see attached backtrace).
--
Do not reply to this email, post in Bugzilla using the
above URL to reply.
You are receiving this mail because:
You are watching all bug changes.
https://bugs.winehq.org/show_bug.cgi?id=39053
Bug ID: 39053
Summary: The Forest: Starting a game needs often a long time
Product: Wine
Version: 1.7.44
Hardware: x86-64
OS: Linux
Status: UNCONFIRMED
Severity: normal
Priority: P2
Component: -unknown
Assignee: wine-bugs(a)winehq.org
Reporter: sworddragon2(a)aol.com
Distribution: ---
Loading a game instance needs sometimes only some seconds but sometimes it also
needs some minutes. For example on creating a new game in single player this
needs mostly some minutes while on joining a multiplayer game it is vice versa.
--
Do not reply to this email, post in Bugzilla using the
above URL to reply.
You are receiving this mail because:
You are watching all bug changes.
https://bugs.winehq.org/show_bug.cgi?id=46418
Bug ID: 46418
Summary: I am getting this when I am going to install msi file.
fixme:ntdll:NtLockFile I/O completion on lock not
implemented ye
Product: Wine
Version: unspecified
Hardware: x86
OS: Linux
Status: UNCONFIRMED
Severity: normal
Priority: P2
Component: ntdll
Assignee: wine-bugs(a)winehq.org
Reporter: gautam.k(a)cisinlabs.com
Distribution: ---
Created attachment 63184
--> https://bugs.winehq.org/attachment.cgi?id=63184
I am install openssl using msi exec
Hi,
Please have a look at this error.
I am getting this when I am going to install msi file.
fixme:ntdll:NtLockFile I/O completion on lock not implemented yet
--
Do not reply to this email, post in Bugzilla using the
above URL to reply.
You are receiving this mail because:
You are watching all bug changes.
https://bugs.winehq.org/show_bug.cgi?id=44411
Bug ID: 44411
Summary: CRASHING AND LACKING FONT civilization call to power
Product: Wine
Version: 3.0-rc6
Hardware: x86
OS: Linux
Status: UNCONFIRMED
Severity: normal
Priority: P2
Component: -unknown
Assignee: wine-bugs(a)winehq.org
Reporter: kitisanutter(a)gmail.com
Distribution: ---
Game crashes with core fonts, there is nothing to suggest reason why other than
lack of core fonts.
--
Do not reply to this email, post in Bugzilla using the
above URL to reply.
You are receiving this mail because:
You are watching all bug changes.
http://bugs.winehq.org/show_bug.cgi?id=35428
Bug ID: 35428
Summary: Screenshots get horribly broken and resized on upload
Product: WineHQ Apps Database
Version: unspecified
Hardware: x86
OS: Linux
Status: UNCONFIRMED
Severity: normal
Priority: P2
Component: appdb-unknown
Assignee: wine-bugs(a)winehq.org
Reporter: t.artem(a)mailcity.com
Classification: Unclassified
Created attachment 47281
--> http://bugs.winehq.org/attachment.cgi?id=47281
Far 3 original screenshot
Consider this beautiful PNG screenshot.
Size: 106331 bytes
Format: PNG/lossless
Resolution: 1284x744@24bpp
What AppDB turns it to:
http://appdb.winehq.org/screenshots.php?iAppId=953&iVersionId=27377
Size: 196888 bytes (2 times more!)
Format: Bad resized PNG
Resolution: 1024×593@24bpp
This needs to be fixed. We live in the 21 century.
--
Do not reply to this email, post in Bugzilla using the
above URL to reply.
You are receiving this mail because:
You are watching all bug changes.
http://bugs.winehq.org/show_bug.cgi?id=35756
Bug ID: 35756
Summary: Bugzilla robots.txt prevents google indexing
Product: WineHQ Bugzilla
Version: unspecified
Hardware: x86
OS: Linux
Status: NEW
Severity: normal
Priority: P2
Component: bugzilla-unknown
Assignee: wine-bugs(a)winehq.org
Reporter: adys.wh(a)gmail.com
https://bugs.winehq.org/robots.txt
This is annoying as bugs cant be found through google.
--
Do not reply to this email, post in Bugzilla using the
above URL to reply.
You are receiving this mail because:
You are watching all bug changes.
http://bugs.winehq.org/show_bug.cgi?id=11787
Summary: Set mime type for log files are text/plain
Product: WineHQ Bugzilla
Version: unspecified
Platform: Other
OS/Version: other
Status: NEW
Severity: minor
Priority: P2
Component: bugzilla-unknown
AssignedTo: wine-bugs(a)winehq.org
ReportedBy: thestig(a)google.com
Right now whenever someone attaches a .log file, Bugzilla auto-detects the mime
type as text/x-log. Many web browsers are set to download files with that mime
type, rather than just opening the file in the web browser. This is rather
annoying.
Can we change the mime types for .log files to text/plain instead? I believe
the code is in Bugzilla/Attachment.pm.
--
Configure bugmail: http://bugs.winehq.org/userprefs.cgi?tab=email
Do not reply to this email, post in Bugzilla using the
above URL to reply.
------- You are receiving this mail because: -------
You are watching all bug changes.
http://bugs.winehq.org/show_bug.cgi?id=19561
Summary: Very large memory leak when doing overlapped reads
Product: Wine
Version: 1.1.26
Platform: PC
OS/Version: Linux
Status: UNCONFIRMED
Severity: major
Priority: P2
Component: wineserver
AssignedTo: wine-bugs(a)winehq.org
ReportedBy: ronfischler(a)gmail.com
Created an attachment (id=22796)
--> (http://bugs.winehq.org/attachment.cgi?id=22796)
Program compiled and ready to run using mingw
WINE is buffering serial ports which is in conflict with using overlapped
reads. Additionally, when using overlapped reads on a serial port, there is a
large memory leak. Every time we receive a block of data on the port, (say 800
bytes in our case,) wineserver allocates many pages on the heap and does not
free them afterwards. We are seeing as many as 21 pages lost to the heap every
time we read a small block of data.
My company is creating a Monitor & Control product that works through serial
ports, and we want it to be able to run on Linux netbooks (using USB to serial
port adapters.) This memory leak is the only thing holding us up. The memory
leak is too large for us to recommend to customers that our application can be
used on Linux platforms using WINE.
We are including an attachment for a small program that captures the leak. The
problem is a result of our call to readfile() in the do-while loop. It is using
the overlappedRead feature. Every time this Win32 function call is made, 84K
bytes disappears forever.
-Ron F.
--
Configure bugmail: http://bugs.winehq.org/userprefs.cgi?tab=email
Do not reply to this email, post in Bugzilla using the
above URL to reply.
------- You are receiving this mail because: -------
You are watching all bug changes.
https://bugs.winehq.org/show_bug.cgi?id=38337
Bug ID: 38337
Summary: clang compiling warnings
Product: Wine
Version: 1.7.39
Hardware: x86
OS: Linux
Status: UNCONFIRMED
Severity: normal
Priority: P2
Component: -unknown
Assignee: wine-bugs(a)winehq.org
Reporter: isakov-sl(a)bk.ru
Distribution: ---
Wine1.7.39-251-gdbf8bde compiled by Apple's clang. The wine works somehow.
There are hundreds warning so I show them in one bug although there are many
possible bugs.
----
keyboard.c:287:2: warning: illegal character encoding in string literal
[-Winvalid-source-encoding]
"?","&1","?2","\"3","'4","(5","-6","?7","_8","?9","?0",")?","=+",
^
----
cocoa_status_item.m:100:13: warning: instance method
'-discardEventsPassingTest:'
not found (return type defaults to 'id')
[queue discardEventsPassingTest:^BOOL (macdrv_event* event){
^~~~~~~~~~~~~~~~~~~~~~~~~~~~~~~~~~~~~~~~~~~~~~~~~~~~~~~~~~~~
1 warning generated.
----
imgfactory.c:715:88: warning: implicit conversion from enumeration type
'WICBitmapAlphaChannelOption' (aka 'enum WICBitmapAlphaChannelOption') to
different enumeration type 'WICBitmapCreateCacheOption' (aka 'enum
WICBitmapCreateCacheOption') [-Wconversion]
...BitmapImpl_Create(bm.bmWidth, bm.bmHeight, bm.bmWidthBytes, 0, NULL,
&format, option,...
~~~~~~~~~~~~~~~~~
^~~~~~
-----
display.c:225:24: warning: unused function 'create_mode_dict'
[-Wunused-function]
static CFDictionaryRef create_mode_dict(CGDisplayModeRef display_mode)
^
1 warning generated.
-----
node.c:1620:37: warning: implicit conversion from enumeration type
'xmlElementType' to different enumeration type 'DOMNodeType' (aka
'enum tagDOMNodeType') [-Wconversion]
*domNodeType = This->node.node->type;
~ ~~~~~~~~~~~~~~~~~^~~~
1 warning generated.
-----
locale.c:11344:13: warning: unknown attribute '__force_align_arg_pointer__'
ignored [-Wattributes]
call_locale_facet_vector_dtor(iter->fac, 1);
^~~~~~~~~~~~~~~~~~~~~~~~~~~~~~~~~~~~~~~~~~~
locale.c:246:52: note: expanded from macro 'call_locale_facet_vector_dtor'
#define call_locale_facet_vector_dtor(this, flags) CALL_VTBL_FUNC(this, 0, \
^
./cxx.h:269:59: note: expanded from macro 'CALL_VTBL_FUNC'
#define CALL_VTBL_FUNC(this, off, ret, type, args) ((ret (WINAPI*...
^
../../include/windef.h:169:21: note: expanded from macro 'WINAPI'
#define WINAPI __stdcall
^
../../include/msvcrt/crtdefs.h:48:67: note: expanded from macro '__stdcall'
...__attribute__((__stdcall__)) __attribute__((__force_align_arg_pointer__))
^~~~~~~~~~~~~~~~~~~~~~~~~~~
-----
mach.c:93:9: warning: 'bootstrap_register' is deprecated
[-Wdeprecated-declarations]
if (bootstrap_register(bp, (char*)wine_get_server_dir(), ...
^
----
warning: Small Fonts 11: missing glyph for char 05b0
----
file.c:2124:49: warning: array index 1 is past the end of the array
(which contains 1 element) [-Warray-bounds]
dir_info->FileName[0] == '.' && dir_info->FileName[1] == ...
^ ~
../../include/winternl.h:495:5: note: array 'FileName' declared here
WCHAR FileName[ANYSIZE_ARRAY];
^
1 warning generated.
----
I omitted same warnings repeated many times.
--
Do not reply to this email, post in Bugzilla using the
above URL to reply.
You are receiving this mail because:
You are watching all bug changes.
http://bugs.winehq.org/show_bug.cgi?id=12340
Summary: Winambulancia -DB defragmentation crashes
Product: Wine
Version: 0.9.58.
Platform: PC
URL: http://www.softprogres.sk/prog_winamb.php
OS/Version: Linux
Status: UNCONFIRMED
Severity: major
Priority: P2
Component: -unknown
AssignedTo: wine-bugs(a)winehq.org
ReportedBy: tuharsky(a)misbb.sk
WinAmbulancia (see AppDB) is medical software for variety of specialisations of
medical prax. It uses VFP and VB with MDB backend. The app is in Slovak (SK)
language. Mostly the wine problems are related to the OLE.
The database defragmentation function dosen't work properly. In the app, please
go to "Nástroje > Defragmentácia" and the app will crash.
--
Configure bugmail: http://bugs.winehq.org/userprefs.cgi?tab=email
Do not reply to this email, post in Bugzilla using the
above URL to reply.
------- You are receiving this mail because: -------
You are watching all bug changes.
http://bugs.winehq.org/show_bug.cgi?id=18715
Summary: No statusbar in Notepad
Product: Wine
Version: 1.1.22
Platform: PC
OS/Version: Linux
Status: UNCONFIRMED
Severity: enhancement
Priority: P2
Component: programs
AssignedTo: wine-bugs(a)winehq.org
ReportedBy: Eldmannen+wine(a)gmail.com
The Notepad that comes with Wine has no statusbar.
--
Configure bugmail: http://bugs.winehq.org/userprefs.cgi?tab=email
Do not reply to this email, post in Bugzilla using the
above URL to reply.
------- You are receiving this mail because: -------
You are watching all bug changes.
http://bugs.winehq.org/show_bug.cgi?id=21940
Summary: Rise of Legends Demo crashes with null pointer
reference in msxml3?
Product: Wine
Version: 1.1.40
Platform: x86
OS/Version: Linux
Status: NEW
Severity: normal
Priority: P2
Component: msxml3
AssignedTo: wine-bugs(a)winehq.org
ReportedBy: dank(a)kegel.com
Once you get past bug 19539, you have to choose to ignore
two BHG errors; the game then starts and runs (though I got
no sound). Trying to play a campaign crashed for me quickly with
an msxml3 error (which is funny, since I had done winetricks msxml3,
and winecfg shows the override, but the backtrace still shows Wine's msxml3):
Unhandled exception: page fault on read access to 0x00000000 in 32-bit code
(0x7362be22).
Backtrace:
=>0 priv_from_xmlDocPtr+0x6(doc=(nil)) [dlls/msxml3/domdoc.c:127] in msxml3
1 xmldoc_add_ref+0x1d(doc=(nil)) [dlls/msxml3/domdoc.c:160] in msxml3
2 init_xmlnode+0x26(This=0x3fb63f8, node=0x7e222980, outer=0x3fb6418,
dispex_data=0x73666dec) [dlls/msxml3/node.c:1714] in msxml3
3 create_element+0x6c(element=0x7e222980) [dlls/msxml3/element.c:797] in
msxml3d
4 create_node+0x9d(node=0x7e222980) [dlls/msxml3/node.c:1736] in msxml3
5 queryresult_nextNode+0xdf(iface=0x3ff1120, nextItem=0x32ad60)
[dlls/msxml3/queryresult.c:267] in msxml3
6 xmlnode_selectSingleNode+0xd3(iface=0x1e9510, kqueryString="TRIBE_MASK",
resultNode=0x32ad60) [dlls/msxml3/node.c:1542] in msxml3
7 in legends (+0x6f34c) (0x0032b2dc)
...
0x7362be22 priv_from_xmlDocPtr+0x6 [dlls/msxml3/domdoc.c:127] in msxml3: movl
0x0(%eax),%eax
127 return doc->_private;
--
Configure bugmail: http://bugs.winehq.org/userprefs.cgi?tab=email
Do not reply to this email, post in Bugzilla using the
above URL to reply.
------- You are receiving this mail because: -------
You are watching all bug changes.
https://bugs.winehq.org/show_bug.cgi?id=44926
Bug ID: 44926
Summary: Olive tree BibleStudySetup_6.1.1.exe
fails:ITERATE_Actions Execution halted, action
L"WixCreateInternetShortcuts" returned 1603
Product: Wine
Version: 3.4
Hardware: x86
OS: Linux
Status: NEW
Severity: normal
Priority: P2
Component: -unknown
Assignee: wine-bugs(a)winehq.org
Reporter: xerox.xerox2000x(a)gmail.com
Distribution: ---
To see this first work around bug 44135
then:
0039:fixme:msi:ITERATE_CreateShortcuts poorly handled shortcut format,
advertised shortcut
wine: cannot find L"C:\\windows\\system32\\winemenubuilder.exe"
0039:err:msi:ITERATE_Actions Execution halted, action
L"WixCreateInternetShortcuts" returned 1603
0039:err:msi:execute_script Execution of script 2 halted; action
L"[C:\\users\\louis\\Start Menu\\Programs\\Olive Tree Bible Software\\Bible
Study 6 online
support.url\0080http://help.olivetree.com/\00801\0080\00800<=>S-1-5-21-0-0-0-1000<=>{85E9410C-03A6-4396-9688-91981F445D1B}]WixRollbackInternetShortcuts"
returned 1603
sha1sum ~/Downloads/BibleStudySetup_6.1.1.exe
e55cd3df7b44bab85fdcb6785c32aa73988e338b
/home/louis/Downloads/BibleStudySetup_6.1.1.exe
--
Do not reply to this email, post in Bugzilla using the
above URL to reply.
You are receiving this mail because:
You are watching all bug changes.
https://bugs.winehq.org/show_bug.cgi?id=48247
Bug ID: 48247
Summary: Darksiders 2 (GOG) crashes after intro
Product: Wine-staging
Version: 4.20
Hardware: x86-64
OS: Linux
Status: UNCONFIRMED
Severity: normal
Priority: P2
Component: -unknown
Assignee: wine-bugs(a)winehq.org
Reporter: fzielcke(a)z-51.de
CC: leslie_alistair(a)hotmail.com, z.figura12(a)gmail.com
Distribution: ---
Created attachment 65912
--> https://bugs.winehq.org/attachment.cgi?id=65912
log + crash dump with wine-4.20 (staging)
Darksiders 2 directly crashes after the intro.
This is on Debian unstable with the official winehq-staging 4.20 packages for
bullseye
--
Do not reply to this email, post in Bugzilla using the
above URL to reply.
You are receiving this mail because:
You are watching all bug changes.
https://bugs.winehq.org/show_bug.cgi?id=39688
Bug ID: 39688
Summary: Crash in file browser dialog (probably because of >
MAX_PATH)
Product: Wine
Version: 1.6.2
Hardware: x86
OS: Linux
Status: UNCONFIRMED
Severity: normal
Priority: P2
Component: comdlg32
Assignee: wine-bugs(a)winehq.org
Reporter: n296869(a)rtrtr.com
Distribution: ---
Wine's GetOpenFileNameW/GetSaveFileNameW seems to crash when encountering a
very long path name (i.e. longer than MAX_PATH characters).
--
Do not reply to this email, post in Bugzilla using the
above URL to reply.
You are receiving this mail because:
You are watching all bug changes.
https://bugs.winehq.org/show_bug.cgi?id=48746
Bug ID: 48746
Summary: Null_DC stops with error on Emulator Startup (not
opening the application)
Product: Wine
Version: unspecified
Hardware: x86
OS: Linux
Status: UNCONFIRMED
Severity: critical
Priority: P2
Component: apphelp
Assignee: wine-bugs(a)winehq.org
Reporter: starfirehyper(a)gmail.com
Distribution: ---
Hello,
I am having issues with Wine and Null DC
I do have Crossover on a Chromebook, but whatever I start the emulator (not
opening the application) I get a error that tells me " The program (the full
name of the exe) has encountered a serious problem and needs to close." The
link on the error wasn't very helpful. (I am running nullDC 1.0.4 and I don't
know what is causing it)
Thank you and good bye.
Have a nice day! :)
--
Do not reply to this email, post in Bugzilla using the
above URL to reply.
You are receiving this mail because:
You are watching all bug changes.
https://bugs.winehq.org/show_bug.cgi?id=48771
Bug ID: 48771
Summary: SoulWorker from Official Launcher
Product: Wine
Version: 5.4
Hardware: x86-64
OS: Linux
Status: UNCONFIRMED
Severity: normal
Priority: P2
Component: -unknown
Assignee: wine-bugs(a)winehq.org
Reporter: full01(a)linuxmail.org
Distribution: ---
I can't start the game from the Official Launcher. The launcher starts with
Wine-staging but I get the error (The Directory is Invalid) when I try to start
the game client.
The game worked flawlessly before they changed the launcher.
I think the problem is the second launcher called "Soulworkerlauncher.exe".
The game is free to play: https://en.soulworker.gameforge.com/landingpage/
--
Do not reply to this email, post in Bugzilla using the
above URL to reply.
You are receiving this mail because:
You are watching all bug changes.
https://bugs.winehq.org/show_bug.cgi?id=37131
Bug ID: 37131
Summary: Clang Static Analyzer: Division by zero
Product: Wine
Version: 1.7.22
Hardware: x86-64
OS: Linux
Status: UNCONFIRMED
Severity: normal
Priority: P2
Component: -unknown
Assignee: wine-bugs(a)winehq.org
Reporter: lukebenes(a)hotmail.com
Clang Static Analyzer identifies Division by zero
File: dlls/winex11.drv/palette.c
Location: line 601, column 43
Description: Division by zero
#define NB_RESERVED_COLORS 20
...
static void X11DRV_PALETTE_FillDefaultColors(....)
{
...
int i = 0, idx = 0;
int red, no_r, inc_r;
...
if (palette_size <= NB_RESERVED_COLORS)
return;
while (i*i*i < (palette_size - NB_RESERVED_COLORS)) i++;
no_r = no_g = no_b = --i;
...
inc_r = (255 - NB_COLORCUBE_START_INDEX)/no_r;
//Clang: Division by zero
...
}
The code will continue executing if the palette_size variable is larger than or
equal to 21. With the value 21, the 'i' variable will be first incremented by
one and then decremented by one. As a result, the 'i' variable will remain
equal to zero, which will cause the division-by-zero error.
--
Do not reply to this email, post in Bugzilla using the
above URL to reply.
You are receiving this mail because:
You are watching all bug changes.
http://bugs.winehq.org/show_bug.cgi?id=31212
Bug #: 31212
Summary: Some VST instruments crash when reloaded in Mixcraft
Product: Wine
Version: 1.5.8
Platform: x86
OS/Version: Linux
Status: UNCONFIRMED
Severity: normal
Priority: P2
Component: -unknown
AssignedTo: wine-bugs(a)winehq.org
ReportedBy: s_chriscollins(a)hotmail.com
Classification: Unclassified
In Mixcraft, some VST instruments crash when loaded a second time on a track.
However, the same instruments work fine when loaded for the first time on a
track. The following can be reproduced easily in Mixcraft:
1. Start Mixcraft and select "Build Virtual Instrument Tracks" from the "New
Project" window.
2. Click on the keyboard icon next to the first track name, which will bring up
the instrument selection window.
3. Select "<VSTi Instruments>" from the left pane and then "Messiah" from the
right pane. This sets the track to use the Messiah VSTi synth.
4. Now select "Acoustica Instruments" from the right pane.
5. Once again, select "Messiah" from the right pane. Mixcraft will pop up an
error box with the title "An instrument has crashed" containing the following
text: "A crash has been detected in the instrument "Messiah." This plug-in has
been muted. We recommend you save your project and re-start Mixcraft to avoid
losing your work."
Unfortunately, no helpful terminal output seems to be generated in relation to
the plugin crash. I have provided more detailed notes on VST behavior in
Mixcraft here:
https://docs.google.com/document/d/1YEPh0mkd_ip1whAJXcRIl4HYny5D8LSeGo3qgzV…
** My System **
OS: Kubuntu 12.04 64-bit w/ KDE SC 4.8.4
Motherboard: ASRock X58 Extreme3 (Intel X58 chipset)
CPU: Intel Core i7 (2.8 GHz quad-core)
RAM: 12GB DDR3
Video: Dell NVIDIA GeForce 7800 GTX w/ 256 MB RAM (PCI Express)
Sound Card #1: Sound Blaster Audigy 2 ZS Gold
Sound Card #2: Echo Gina3G
Linux Kernel: 3.2.0-26-generic
NVIDIA video driver: 302.17
Screen Resolution: 1280 x 960
--
Configure bugmail: http://bugs.winehq.org/userprefs.cgi?tab=email
Do not reply to this email, post in Bugzilla using the
above URL to reply.
------- You are receiving this mail because: -------
You are watching all bug changes.
https://bugs.winehq.org/show_bug.cgi?id=42033
Bug ID: 42033
Summary: Fallout 3: Radio music not playing
Product: Wine
Version: 2.0-rc1
Hardware: x86
OS: Linux
Status: UNCONFIRMED
Severity: normal
Priority: P2
Component: -unknown
Assignee: wine-bugs(a)winehq.org
Reporter: aaronbpaden(a)gmail.com
Distribution: ---
Created attachment 56507
--> https://bugs.winehq.org/attachment.cgi?id=56507
log
When listening to the radio in Fallout 3, the DJ's voice works, but the songs
don't. Sometimes you'll hear the song start for a second, but then it stops and
the DJ's voice starts up again. This happens both on GNR and the enclave
station.
--
Do not reply to this email, post in Bugzilla using the
above URL to reply.
You are receiving this mail because:
You are watching all bug changes.
https://bugs.winehq.org/show_bug.cgi?id=42796
Bug ID: 42796
Summary: X11DRV_ActivateKeyboardLayout spam during GTA5 run
Product: Wine
Version: 2.5
Hardware: x86
OS: Linux
Status: UNCONFIRMED
Severity: enhancement
Priority: P2
Component: winex11.drv
Assignee: wine-bugs(a)winehq.org
Reporter: winetest(a)luukku.com
Distribution: ---
I just tested wine-staging 2.5 against GTA5.
And I get my console spammed annoying amount of
These 3 lines group of 3.
fixme:keyboard:X11DRV_ActivateKeyboardLayout 0x4090409, 40000000: semi-stub!
fixme:keyboard:X11DRV_ActivateKeyboardLayout flags 40000000 not supported
fixme:dxgi:dxgi_swapchain_Present Unimplemented flags 0x1
The keyboard spam comes from here
https://source.winehq.org/git/wine.git/blob/61a1a266faa9fa7c959136b0ab0b5d7…
Maybe priting the message few times and putting rest of the spam into TRACE?
Since bug 42017 got fixed the output is much cleaner now.
This is just enchanment request to get better looking logs by default.
--
Do not reply to this email, post in Bugzilla using the
above URL to reply.
You are receiving this mail because:
You are watching all bug changes.
https://bugs.winehq.org/show_bug.cgi?id=47985
Bug ID: 47985
Summary: SysListView32 header are not rendered
Product: Wine
Version: 4.18
Hardware: x86-64
OS: Linux
Status: UNCONFIRMED
Severity: normal
Priority: P2
Component: comctl32
Assignee: wine-bugs(a)winehq.org
Reporter: bitter.taste(a)gmx.com
Distribution: ---
This problem can be noticed if one tries to use LTSpice [1], places a Capacitor
in the schematic, right clicks on it and then on "Select Capacitor".
The window that opens has a blank space where the header is supposed to be,
resizing the windows makes the header appear and clicking on the headers
themselves makes them appear for a brief instant.
[1]
https://www.analog.com/en/design-center/design-tools-and-calculators/ltspic…
--
Do not reply to this email, post in Bugzilla using the
above URL to reply.
You are receiving this mail because:
You are watching all bug changes.
https://bugs.winehq.org/show_bug.cgi?id=38889
Bug ID: 38889
Summary: Microsoft Orca unable to create transform file
Product: Wine
Version: 1.6.2
Hardware: x86
OS: Linux
Status: UNCONFIRMED
Severity: critical
Priority: P2
Component: -unknown
Assignee: wine-bugs(a)winehq.org
Reporter: crosstieger(a)gmail.com
Distribution: ---
Created attachment 51827
--> https://bugs.winehq.org/attachment.cgi?id=51827
terminal output of the error
Microsoft Orca is unable to modify cells within an .msi file. Modifying a cell
returns the following error message:
Could not change this cell to '<Value>'. The data was rejected by the database.
It may be out of the valid range or formatted incorrectly.
In the terminal you can see the error message:
fixme:msidb:TABLE_modify 0x7a5098 4 0x7a5e40 - mode not implemented
The value 0x7a5098 and 0x7a5e40 changes depending on the cell you edit.
If you click on 'Transform - Generate Transform' and want to save your .MST
file, it returns the error:
Orca was unable to generate the transform. (MSI Error 120)
On the terminal:
fixme:msi:MsiDatabaseGenerateTransformW 3 2
L"Z:\\home\\techniktriberg\\Downloads\Untitled.mst" 0 0
The path depends on where you want to save the file.
Full terminal output as an attachment.
----
Installation process
----
run: winetricks dotnet40
run: winetricks mfc42
run: msiexec -i Orca.Msi
--
Do not reply to this email, post in Bugzilla using the
above URL to reply.
You are receiving this mail because:
You are watching all bug changes.
https://bugs.winehq.org/show_bug.cgi?id=48283
Bug ID: 48283
Summary: Pegasus Mail 4.73 crashes after install
Product: Wine
Version: 4.0.3
Hardware: x86-64
OS: Linux
Status: UNCONFIRMED
Severity: normal
Priority: P2
Component: -unknown
Assignee: wine-bugs(a)winehq.org
Reporter: daveypy(a)outlook.com
Distribution: ---
Created attachment 65965
--> https://bugs.winehq.org/attachment.cgi?id=65965
Saved backtrace from crash
After installing Pegasus Mail in Wine, Pegasus Mail crashes upon launch.
I would be willing to test this in Wine STAGING, but I don't know how to
install STAGING alongside STABLE in Ubuntu.
--
Do not reply to this email, post in Bugzilla using the
above URL to reply.
You are receiving this mail because:
You are watching all bug changes.
http://bugs.winehq.org/show_bug.cgi?id=35684
Bug ID: 35684
Summary: Wine Internet Explorer crash when accessing amazon.com
Product: Wine
Version: 1.7.13
Hardware: x86
OS: Linux
Status: UNCONFIRMED
Severity: normal
Priority: P2
Component: -unknown
Assignee: wine-bugs(a)winehq.org
Reporter: daniel.maccabe(a)gmail.com
Created attachment 47650
--> http://bugs.winehq.org/attachment.cgi?id=47650
Backtrace of Wine failure when accessing amazon.com
OS: Linux Mint 16 (Petra) with KDE desktop
Using Wine 1.7.13 in WIN7 mode (also tried WIN XP mode)
Running Wine internet explorer from C:\program files (x86)
Internet Explorer seems to start normally, although slowly. The Winehq web
page loads and appears to render correctly. If I try to access www.amazon.com
(http, or https) the program experiences an error and quits. The following
window is displayed:
report says:
Program Error
The program iexplore.exe has encountered a serious problem and needs to close.
We are sorry for the inconvenience.
This can be caused by a problem in the program or a deficiency in Wine.
--
Do not reply to this email, post in Bugzilla using the
above URL to reply.
You are receiving this mail because:
You are watching all bug changes.
https://bugs.winehq.org/show_bug.cgi?id=44236
Bug ID: 44236
Summary: Poisson Superfish: Slow to write binary file.
Product: Wine
Version: 2.21
Hardware: x86-64
OS: Linux
Status: UNCONFIRMED
Severity: normal
Priority: P2
Component: cmd
Assignee: wine-bugs(a)winehq.org
Reporter: raphaelcervantes(a)protonmail.com
Distribution: ---
Discussion is in this forum.
https://forum.winehq.org/viewtopic.php?f=2&t=29936
I am using Wine to run Poisson Superfish. This program essentially does some
calculations and then writes the results into a binary file. This action is
performed in less than a second in a Windows environment. Unfortunately, it
takes about 10 seconds to write this binary file under Wine. Here is how to
reproduce the error:
1. Install Poisson Superfish on linux using Wine. You have to scroll all the
way down and click register.
http://laacg.lanl.gov/laacg/services/download_sf.phtml
2. Once installed, open a unix terminal in this directory
.../.wine/drive_c/LANL/Examples/RadioFrequency/Waveguides/
3. Run wineconsole cmd.
4. In the new window, run RUNWG.BAT.
3. Several windows will pop up. The ones that stall for a bit are in the
process of writing to a file named something.T35. The T35 refers to tape 35 (I
guess that's how a sector of harddrive memory would be referred as back in the
80s). This is the binary file with the solution in it.
It will finish eventually, but it is pretty slow.
--
Do not reply to this email, post in Bugzilla using the
above URL to reply.
You are receiving this mail because:
You are watching all bug changes.
https://bugs.winehq.org/show_bug.cgi?id=44253
Bug ID: 44253
Summary: Access violation in multiple cases
Product: Wine
Version: 3.0-rc3
Hardware: x86-64
OS: Linux
Status: UNCONFIRMED
Severity: critical
Priority: P2
Component: -unknown
Assignee: wine-bugs(a)winehq.org
Reporter: ihormcd+wine(a)gmail.com
Distribution: ---
Created attachment 60052
--> https://bugs.winehq.org/attachment.cgi?id=60052
crash
Access violation exception due to access by 0x0000 address in multiple use
cases while using Far3.
>From Far app try to:
1) on lunch of EXE file (Far.exe, WinMergeU.exe, others)
2) switch drive for the pane (Alt+F1/F2)
3) switch to Quick view mode for a file (Ctrl+Q)
*) few other cases
App: Far Manager 3.0 build 5100 x64
Wine details: wine-3.0-rc3, the app runs using wineconsole
--
Do not reply to this email, post in Bugzilla using the
above URL to reply.
You are receiving this mail because:
You are watching all bug changes.
https://bugs.winehq.org/show_bug.cgi?id=46930
Bug ID: 46930
Summary: DirectX 1 installer Closes after open without
installing
Product: Wine
Version: 3.0
Hardware: x86
OS: Linux
Status: UNCONFIRMED
Severity: normal
Priority: P2
Component: msvcp
Assignee: wine-bugs(a)winehq.org
Reporter: sk9258user(a)mail.ru
Distribution: ---
Created attachment 64037
--> https://bugs.winehq.org/attachment.cgi?id=64037
log
I change wine Windows version to 95 and open DirectX 1.0 installer, but window
instant closes and Installing stopped on unpacking. In logs I see msvcp error
missing shm_open() function. WTF???
--
Do not reply to this email, post in Bugzilla using the
above URL to reply.
You are receiving this mail because:
You are watching all bug changes.
https://bugs.winehq.org/show_bug.cgi?id=46552
Bug ID: 46552
Summary: Crossfire doesn't install
Product: Wine
Version: 4.0-rc7
Hardware: x86-64
URL: http://crossfire.z8games.com/download.html
OS: Linux
Status: UNCONFIRMED
Severity: normal
Priority: P2
Component: -unknown
Assignee: wine-bugs(a)winehq.org
Reporter: luca.finizio.mgbx(a)hotmail.it
Distribution: Mint
Created attachment 63423
--> https://bugs.winehq.org/attachment.cgi?id=63423
console output
I already reported a bug about Crossfire EU (you can find it here
https://bugs.winehq.org/show_bug.cgi?id=45920), but now it merged with
Crossfire NA and the new link for download is
http://crossfire.z8games.com/download.html
The .exe file is different than before, but it doesn't install yet; I don't
know if the problem is the same or not. I attached my console output. You can
reproduce the bug just by downloading the file and trying to install.
I kept my terminal open for more than 3 hours beacuse the process is "running"
and if I close the terminal it says that a process is still running and closing
the terminal will kill it. Therefore I don't know if my console output is
complete or not. If I can help in some way, just tell me! :)
--
Do not reply to this email, post in Bugzilla using the
above URL to reply.
You are receiving this mail because:
You are watching all bug changes.
https://bugs.winehq.org/show_bug.cgi?id=37297
Bug ID: 37297
Summary: CreateEdit windows always fullscreen under wine
Product: Wine
Version: 1.7.26
Hardware: x86
OS: Linux
Status: UNCONFIRMED
Severity: normal
Priority: P2
Component: -unknown
Assignee: wine-bugs(a)winehq.org
Reporter: n4af(a)n4af.net
ref:
https://forum.winehq.org/viewtopic.php?t=23405&p=96423
I have a Pascal (Dephi) app that runs well under Wine application layer.
The problem is that there are a number of edit controls that will only show in
full screen under Wine.
This would be an example of a procedure to create a editable window using Alt-D
WM_INITDIALOG:
begin
Windows.SetWindowText(hwnddlg, RC_DUPECHECKOAR);
Format(TempBuffer1, TC_ENTERCALLTOBECHECKEDON,
BandStringsArray[InActiveRadioPtr.BandMemory],
ModeStringArray[InActiveRadioPtr.ModeMemory]);
CreateStatic(TempBuffer1, 15, 3, 250, hwnddlg, 102);
AltDEditWindowHandle := CreateEdit(ES_CENTER or ES_UPPERCASE or WS_BORDER,
15, 27, 250, 30, hwnddlg, 101);
asm
mov edx,[MainWindowEditFont]
call tWM_SETFONT
end;
CreateOKCancelButtons(hwnddlg);
The above CreateEdit dutifully creates a window under Win7.
Ubuntu (kernel 3.16) will only display as fullscreen.
Under linux I can grab the title bar and move the f/s window but nothing else.
Right clicking on the title bar i have options Restore, Resize, Maximize
selected.
Screen captures on https://forum.winehq.org/viewtopic.php?t=23405&p=96423
Tks, Howard
--
Do not reply to this email, post in Bugzilla using the
above URL to reply.
You are receiving this mail because:
You are watching all bug changes.
http://bugs.winehq.org/show_bug.cgi?id=31278
Bug #: 31278
Summary: The Longest Journey: "eye-mouth-hand" dialog only
appears sometimes (randomly?)
Product: Wine
Version: 1.5.9
Platform: x86
OS/Version: Linux
Status: UNCONFIRMED
Severity: normal
Priority: P2
Component: -unknown
AssignedTo: wine-bugs(a)winehq.org
ReportedBy: rmmartins(a)gmail.com
Classification: Unclassified
This bug has been described by Octavian Vocu on one of his comments in another
bug report from the same game
(http://bugs.winehq.org/show_bug.cgi?id=11819#c39). I'm pasting an excerpt of
his comment below because it explains exactly what's happening:
"There is still some issue related to doing actions on objects, with the mouse.
Clicking an actionable object should display the eye-mouth-hand dialog. Mouse
shows correct pointer, but simply clicking has no effect. I noticed that as you
push the left mouse button, you need to move the mouse slightly for the action
dialog to appear. Might be related to transparent windows, not sure yet."
It's certainly a different bug and deserves a different report, that's why I'm
creating this.
I've tested this on Debian Sid (i386) with wine-1.5.9. The console output is
small, so I just pasted it below; the messages look the same as every other bug
report on the game. The last three fixme's repeat a million times.
fixme:win:EnumDisplayDevicesW ((null),0,0x33eb04,0x00000000), stub!
fixme:ddraw:ddraw7_Initialize Ignoring guid
{00000000-0000-0000-0000-000000000000}.
fixme:d3d_surface:wined3d_surface_flip Ignoring flags 0x1.
fixme:d3d_surface:surface_load_location Unimplemented location SFLAG_INSYSMEM
for depth/stencil buffers.
fixme:d3d_surface:surface_unmap Depth / stencil buffer locking is not
implemented.
fixme:d3d:state_subpixel Render state WINED3D_RS_SUBPIXEL not implemented yet.
fixme:d3d:state_flushbatch Render state WINED3D_RS_FLUSHBATCH not implemented
yet.
fixme:d3d_surface:surface_load_location Unimplemented location SFLAG_INSYSMEM
for depth/stencil buffers.
fixme:d3d_surface:surface_load_location Unimplemented location SFLAG_INSYSMEM
for depth/stencil buffers.
fixme:d3d_surface:surface_unmap Depth / stencil buffer locking is not
implemented.
It might be important to notice that Octavian was probably on the right track
of fixing this with his previous patches. The game runs pretty well on 1.3.32
with three of his patches (http://bugs.winehq.org/show_bug.cgi?id=11819#c37);
the issue reported here is the main thing keeping it from being almost perfect.
Also, on a 1.5.9 with the same three patches (even though the characters are
invisible again) the following three messages appear when you click an object
(when the dialog should be displayed):
fixme:x11drv:X11DRV_WindowPosChanged transparent window, fixing window rect
fixme:x11drv:X11DRV_WindowPosChanged transparent window, fixing window rect
fixme:x11drv:X11DRV_WindowPosChanged transparent window, fixing window rect
--
Configure bugmail: http://bugs.winehq.org/userprefs.cgi?tab=email
Do not reply to this email, post in Bugzilla using the
above URL to reply.
------- You are receiving this mail because: -------
You are watching all bug changes.
https://bugs.winehq.org/show_bug.cgi?id=41644
Bug ID: 41644
Summary: Civilization v1.2: crashes on startup
Product: Wine
Version: 1.9.22
Hardware: x86-64
OS: Linux
Status: UNCONFIRMED
Severity: normal
Priority: P2
Component: -unknown
Assignee: wine-bugs(a)winehq.org
Reporter: K_ThaaL(a)bk.ru
Distribution: ---
Created attachment 56018
--> https://bugs.winehq.org/attachment.cgi?id=56018
trace generated by wine
Wine crashes right after the first frame of game intro is shown.
Created a new 32bit wine prefix for this game.
Tried windows versions XP and 3.1 - behavior is the same in both cases.
Using virtual desktop and disallowing window decorations did not help.
No other options tried.
Ubuntu 16.04 LTS is used with Wine installed from winehq repository.
Problem is detected on 1.9.21 and 1.9.22.
--
Do not reply to this email, post in Bugzilla using the
above URL to reply.
You are receiving this mail because:
You are watching all bug changes.
https://bugs.winehq.org/show_bug.cgi?id=44788
Bug ID: 44788
Summary: Civilization II (v1.02) crash during menus
Product: Wine
Version: 3.4
Hardware: x86
OS: Linux
Status: UNCONFIRMED
Severity: normal
Priority: P2
Component: -unknown
Assignee: wine-bugs(a)winehq.org
Reporter: danielalston(a)gmail.com
Distribution: ---
Created attachment 60814
--> https://bugs.winehq.org/attachment.cgi?id=60814
Backtrace
The game will open, the music plays however every few seconds the sound will
make an awful corrupt sounding noise (possibly related).
The game will usually crash quite quickly. If you're extremely fast you might
be able to get in a game and make a couple of moves before the game crashes
again.
I have similar issues with other 16bit versions of Civilization II.
2.42 patch
2.78 (Fantastic Worlds)
--
Do not reply to this email, post in Bugzilla using the
above URL to reply.
You are receiving this mail because:
You are watching all bug changes.
https://bugs.winehq.org/show_bug.cgi?id=45857
Bug ID: 45857
Summary: Incorrect text color (The Longest Journey)
Product: Wine
Version: 3.16
Hardware: x86-64
URL: https://games.softpedia.com/get/Games-Demo/The-Longest
-Journey-161-Demo.shtml
OS: Linux
Status: UNCONFIRMED
Severity: normal
Priority: P2
Component: -unknown
Assignee: wine-bugs(a)winehq.org
Reporter: jhansonxi(a)gmail.com
Distribution: Ubuntu
Created attachment 62344
--> https://bugs.winehq.org/attachment.cgi?id=62344
Wine screenshot
In-game text is outlined in a magenta color. See attached screenshots.
Reproduced with demo 161 and full version (GOG.com) build 142.
MD5: 6d7f91e0a19513e859775862b2ac43d8 thelongestjourneydemo_english.exe
wine-devel 3.16.0~xenial from winehq.org
Xbuntu 16.04.5 x86_64
Nvidia GeFOrce GTX 750 Ti, driver version 384.130
--
Do not reply to this email, post in Bugzilla using the
above URL to reply.
You are receiving this mail because:
You are watching all bug changes.
https://bugs.winehq.org/show_bug.cgi?id=41549
Bug ID: 41549
Summary: Hover! in fullscreen mode does not cover the top bar
in Gnome.
Product: Wine
Version: 1.9.20
Hardware: x86
OS: Linux
Status: UNCONFIRMED
Severity: normal
Priority: P2
Component: -unknown
Assignee: wine-bugs(a)winehq.org
Reporter: aaronbpaden(a)gmail.com
Distribution: ---
I'm using wine-staging 1.9.20.
When you set Hover! to fullscreen, it sets the display resolution and fills up
most of the screen as it should, but it's set under top bar in GNOME, resulting
in several rows of pixels from the bottom of the application also being outside
of the display.
I confirmed that Hover! does cover the task bar in a Windows VM.
There's nothing really in the logs, except for a weird
"fixme:process:LoadModule Strange error set by CreateProcess: 193", but that
shows up before setting fullscreen.
--
Do not reply to this email, post in Bugzilla using the
above URL to reply.
You are receiving this mail because:
You are watching all bug changes.
https://bugs.winehq.org/show_bug.cgi?id=37192
Bug ID: 37192
Summary: Some Chinese displayed as garbage in DushuBus
everytime updating bookmarks
Product: Wine
Version: unspecified
Hardware: x86
OS: Linux
Status: UNCONFIRMED
Severity: normal
Priority: P2
Component: -unknown
Assignee: wine-bugs(a)winehq.org
Reporter: penghao(a)linuxdeepin.com
DushuBus is an online book reader.
Download DushuBus from http://www.dushubus.com/down/book_setup_12.4.exe
Install Dushbus and dependencies: winetricks -q mdac28 jet40.
Step 0.Start DushuBus from
C:/Program Files/读书巴士/Book.exe
Step 1. Click the 网站设置 (Network settings) item from the dropdown menu in the
right top corner of DushuBus:
Step 2. Click 小说正文标识设置 (Bookmarks settings)
Step 3. Click 在线更新 (online update)
Step 4. Click 确定 (ok)
See: dushubus_code.png for screenshot
Some Chinese characters display in garbage.
===
未完待续,欲知后事如何,请登录新浪原创┰母嗾陆凇VС肿髡撸С终妗?lt;/p><p>新浪原创:http://vip.book.sina.com.cn
===
--
Do not reply to this email, post in Bugzilla using the
above URL to reply.
You are receiving this mail because:
You are watching all bug changes.
https://bugs.winehq.org/show_bug.cgi?id=38797
Bug ID: 38797
Summary: can not write in Greek in cherrytree and keepnote
Product: Wine
Version: unspecified
Hardware: x86
OS: Linux
Status: UNCONFIRMED
Severity: normal
Priority: P2
Component: -unknown
Assignee: wine-bugs(a)winehq.org
Reporter: grendal74.geo(a)yahoo.com
Distribution: ---
It may not be a wine problem
http://portableapps.com/apps/office/cherrytree-portable
and
http://portableapps.com/apps/office/keepnote-portable
These are note taking apps.
They work ok with wine but can not write notes in Greek.
In other note taking apps like
http://portableapps.com/apps/office/babelpad-portable
, I am able to write Greek.
--
Do not reply to this email, post in Bugzilla using the
above URL to reply.
You are receiving this mail because:
You are watching all bug changes.
https://bugs.winehq.org/show_bug.cgi?id=48060
Bug ID: 48060
Summary: no internet connectivity within wine ubuntu 19.04
Product: Wine
Version: 4.0-rc1
Hardware: x86
OS: Linux
Status: UNCONFIRMED
Severity: normal
Priority: P2
Component: -unknown
Assignee: wine-bugs(a)winehq.org
Reporter: mike.lussier(a)gmail.com
Distribution: ---
running Ubuntu 19.04
I'm running Winlink-express and its complaining that there is no internet
connectivity. This is the first time in years that I have actually gotten wine
to install on ubuntu without complaining and now this.
wine version
wine-4.0 (Ubuntu 4.0-1)
wine-mono-4.7.1
wintricks 20190912-next
dotnet35sp1
--
Do not reply to this email, post in Bugzilla using the
above URL to reply.
You are receiving this mail because:
You are watching all bug changes.
http://bugs.winehq.org/show_bug.cgi?id=27584
Summary: MFC fillrect draws differently under wine
Product: Wine
Version: 1.3.21
Platform: x86
OS/Version: Linux
Status: UNCONFIRMED
Severity: normal
Priority: P2
Component: gdi32
AssignedTo: wine-bugs(a)winehq.org
ReportedBy: bailey937(a)yahoo.com
Created an attachment (id=35259)
--> (http://bugs.winehq.org/attachment.cgi?id=35259)
sample program for reproducing FillRect bug
I have a program that uses CPaintDC.FillRect() to draw histogram samples.
It draws one-pixel wide vertical rectangles.
Under wine, the bottom-most pixel is not drawn.
I'm attaching a sample program. Under Windows7 (have 64bit pro), the red line
is touching the black baseline and the black line on the right is touching the
baseline also.
When I run the program under wine, both the red vertical line on the left and
the black vertical line on the right are floating one pixel above the baseline.
I tried both 32bit Ubuntu 11.04 (wine 1.2.2) on a netbook and also Fedora 15
64bit (wine 1.3.21) under Virtualbox on my Windows machine. Both have the same
problem.
The relevant code for the test case is in
CChildView::OnPaint() in ChildView.cpp
--
Configure bugmail: http://bugs.winehq.org/userprefs.cgi?tab=email
Do not reply to this email, post in Bugzilla using the
above URL to reply.
------- You are receiving this mail because: -------
You are watching all bug changes.
https://bugs.winehq.org/show_bug.cgi?id=48483
Bug ID: 48483
Summary: Mouse cursor always visible in Gothic 2 with D3D11
renderer
Product: Wine-staging
Version: 5.0-rc4
Hardware: x86-64
OS: Linux
Status: UNCONFIRMED
Severity: normal
Priority: P2
Component: -unknown
Assignee: wine-bugs(a)winehq.org
Reporter: supercoolemail(a)seznam.cz
CC: leslie_alistair(a)hotmail.com, z.figura12(a)gmail.com
Distribution: ---
Gothic 2 (Russian with 2.6 no-cd patch) with D3D11 renderer shows X11/KDE mouse
all the time. Cursor should not be visible in Gothic 2 at all. It does not have
any functional impact but it's disturbing.
How to reproduce:
- Get Gothic 2.
- Test G2 works (menu at least).
- Extract GD3D11 (e.g. from
https://github.com/Kirides/GD3D11/releases/download/v17.7-dev8/Gothic2-GD3D…
but even old versions from Liker suffer from same issue). DLLs from archive
belong to `<game dir>/System` directory.
- Start the game with `ddraw=n,b`.
- See that mouse cursor appears when menu finishes loading. Alternatively,
mouse movements make cursor appear even before menu finishes loading.
There is some analysis here https://github.com/Tk-Glitch/PKGBUILDS/issues/428 .
I can confirm that same issue happens with clean wine-staging 5.0rc4 from Arch
repositories (also with wine-tkg built from master). While clean G2 works
properly in vanilla wine, GD3D11 needs staging otherwise it crashes at startup.
Tested on
`Linux coolhost 5.4.12-arch1-1 #1 SMP PREEMPT Tue, 14 Jan 2020 21:44:31 +0000
x86_64 GNU/Linux`
Ryzen 7 1700
RX 580 8G
16 G RAM
mesa 19.3.2
--
Do not reply to this email, post in Bugzilla using the
above URL to reply.
You are receiving this mail because:
You are watching all bug changes.
https://bugs.winehq.org/show_bug.cgi?id=38705
Bug ID: 38705
Summary: Gothic crashes on saving games
Product: Wine
Version: 1.7.40
Hardware: x86-64
OS: Linux
Status: UNCONFIRMED
Severity: normal
Priority: P2
Component: -unknown
Assignee: wine-bugs(a)winehq.org
Reporter: amlopezalonso(a)gmail.com
Distribution: ---
Created attachment 51633
--> https://bugs.winehq.org/attachment.cgi?id=51633
Crash backtrace
Gothic 1.08j always crashes when trying to save a game, right after entering
savegame name. Attaching backtrace.
--
Do not reply to this email, post in Bugzilla using the
above URL to reply.
You are receiving this mail because:
You are watching all bug changes.
http://bugs.winehq.org/show_bug.cgi?id=23193
Summary: wine notepad: Slow to open large files
Product: Wine
Version: 1.2-rc1
Platform: x86
URL: http://winehq.org
OS/Version: Linux
Status: UNCONFIRMED
Severity: normal
Priority: P2
Component: programs
AssignedTo: wine-bugs(a)winehq.org
ReportedBy: adys.wh(a)gmail.com
Created an attachment (id=28858)
--> (http://bugs.winehq.org/attachment.cgi?id=28858)
Long text file (3.1M uncompressed)
gunzip the attached file and open it in notepad. For me, it takes > 5 seconds
to open on a quadcore. WinXP notepad (both virtualbox and native) will open it
instantly.
--
Configure bugmail: http://bugs.winehq.org/userprefs.cgi?tab=email
Do not reply to this email, post in Bugzilla using the
above URL to reply.
------- You are receiving this mail because: -------
You are watching all bug changes.
https://bugs.winehq.org/show_bug.cgi?id=37789
Bug ID: 37789
Summary: cmd.exe /c cannot handle "(" and ")" characters in a
full script path name
Product: Wine
Version: 1.7.33
Hardware: x86-64
OS: Linux
Status: UNCONFIRMED
Severity: normal
Priority: P2
Component: cmd
Assignee: wine-bugs(a)winehq.org
Reporter: abolte(a)systemsaviour.com
Distribution: ---
Created attachment 50334
--> https://bugs.winehq.org/attachment.cgi?id=50334
Various cmd executions discussed in the report using WINEDEBUG='+cmd'.
Far Cry 4 (which requires at least a 64-bit Windows 7 prefix) fails to call a
bash script on launch:
Can't recognise 'C:\Program Files (x86)\Ubisoft\Ubisoft Game Launcher\games\Far
Cry 4\Support\Software\GEFirewall.bat /silent' as an internal or external
command, or batch script.
Sure enough, calling it manually (even without the /silent argument) results in
the same error:
$ wine cmd.exe /c 'C:\Program Files (x86)\Ubisoft\Ubisoft Game
Launcher\games\Far Cry 4\Support\Software\GEFirewall.bat'
Can't recognise 'C:\Program Files (x86)\Ubisoft\Ubisoft Game Launcher\games\Far
Cry 4\Support\Software\GEFirewall.bat' as an internal or external command, or
batch script.
Suspicious of the ( and ) characters in the URL, I tried copying the
GEFirewall.bat to the path 'C:\Program Files\Ubisoft\Ubisoft Game
Launcher\games\Far Cry 4\Support\Software\' (which doesn't normally exist but I
manually created it).
$ wine cmd.exe /c 'C:\Program Files\Ubisoft\Ubisoft Game Launcher\games\Far Cry
4\Support\Software\GEFirewall.bat'
fixme:netsh:wmain stub: L"netsh" L"firewall" L"add" L"allowedprogram"
L"C:\\Program Files\\Ubisoft\\Ubisoft Game Launcher\\games\\Far Cry
4\\Support\\Software\\..\\..\\bin\\FarCry4.exe" L"FarCry4" L"ENABLE"
fixme:netsh:wmain stub: L"netsh" L"firewall" L"add" L"allowedprogram"
L"C:\\Program Files\\Ubisoft\\Ubisoft Game Launcher\\games\\Far Cry
4\\Support\\Software\\..\\..\\bin\\IGE_WPF64.exe" L"FarCry4-IGE" L"ENABLE"
The script ran perfectly.
One more test to confirm my sanity:
$ wine explorer.exe 'C:\Program Files (x86)\Ubisoft\Ubisoft Game
Launcher\games\Far Cry 4\Support\Software'
This opened the directory in explorer fine. Only cmd.exe /c ... seems to show
this issue.
--
Do not reply to this email, post in Bugzilla using the
above URL to reply.
You are receiving this mail because:
You are watching all bug changes.
https://bugs.winehq.org/show_bug.cgi?id=47024
Bug ID: 47024
Summary: Pen pressure does not register full range
Product: Wine-staging
Version: 4.6
Hardware: x86-64
OS: Linux
Status: UNCONFIRMED
Severity: normal
Priority: P2
Component: -unknown
Assignee: wine-bugs(a)winehq.org
Reporter: metichi(a)gmail.com
CC: leslie_alistair(a)hotmail.com, z.figura12(a)gmail.com
Distribution: ---
Created attachment 64183
--> https://bugs.winehq.org/attachment.cgi?id=64183
Pressure graphs by wine staging version
Using drawing tablets in the wine staging version 4.6 makes the pressure
readings top at about 10% of the input range, while still responsive within it.
I have tested it using Clip Studio Paint version 1.8.7 on ubuntu 18.04.
I tried 2 tablets, a wacom pencil small (using the wacom drivers installed by
default in ubuntu) and a Huion Kanvas GT191 (using digimend drivers v9) with
identical results.
Attached are the pressure suggestions made by CSP while calibrating the
pressure range
--
Do not reply to this email, post in Bugzilla using the
above URL to reply.
You are receiving this mail because:
You are watching all bug changes.
http://bugs.winehq.org/show_bug.cgi?id=33056
Bug #: 33056
Summary: Tablet stylus pressure works in Manga Studio 5 until a
focus or key event occurs
Product: Wine
Version: 1.5.24
Platform: x86
OS/Version: Linux
Status: UNCONFIRMED
Severity: normal
Priority: P2
Component: wintab32
AssignedTo: wine-bugs(a)winehq.org
ReportedBy: aardvark(a)krl.com
Classification: Unclassified
Unlike prior versions, the tablet stylus pressure works for Manga Studio 5;
however, if a key is pressed or the pen goes out of the window and back in,
lines drawn either draw nothing (no pressure?) or are drawn blobby (saw-tooth
pressure) like a chain of tear-drops.
The cursor displayed often jitters between two different cursors (e.g. a small
circle and a large one or a circle and an arrow). This leads me to believe that
it's swapping between two pointing devices, most likely the mouse and the
stylus.
Maybe related to 15443 and other pen pressure bugs.
--
Configure bugmail: http://bugs.winehq.org/userprefs.cgi?tab=email
Do not reply to this email, post in Bugzilla using the
above URL to reply.
------- You are receiving this mail because: -------
You are watching all bug changes.
https://bugs.winehq.org/show_bug.cgi?id=43612
Bug ID: 43612
Summary: Running on Unsupported OS. OS is not Windows 7 or
later
Product: Wine
Version: 2.15
Hardware: x86-64
OS: Linux
Status: UNCONFIRMED
Severity: major
Priority: P2
Component: -unknown
Assignee: wine-bugs(a)winehq.org
Reporter: chrnoboost(a)mailinator.com
Distribution: ---
Created attachment 59028
--> https://bugs.winehq.org/attachment.cgi?id=59028
Error: Running on Unsupported OS. OS is not Windows 7 or later
Setup & Installation
1. Installed Wine-2.15 staging via package installer
2. pass in WINEARCH=win32 and WINEPREFIX=[some perfix] to winecfg. Directory is
not pre-made, so Wine created the directory and did the work.
3. chose Windows 7 and enabled CSMT, VAAPI, EAX under "Staging" tab in winecfg
3. Used Winetricks to install vcrun 2005 - 2015, vcrun6, vcrun6sp6; msxml4 and
6;msc40 and 42 to run Clip Studio Paint 1.6.2
Installed Clip Studio Paint 1.6.2 and started the software with stylus on
tablet ready for use.
Running the software
I got an error saying "Running on unsupported OS. OS is not Windows 7 or later"
--- This software runs on Windows 7. I ran this software on a Windows 7 64bit
machine before.
Clicked passed it, and the workspace loads but I couldn't draw on the canvas. I
get no response from either stylus nor mouse.
--
Do not reply to this email, post in Bugzilla using the
above URL to reply.
You are receiving this mail because:
You are watching all bug changes.
http://bugs.winehq.org/show_bug.cgi?id=19712
Summary: Template text instead of usual information in
VirtualBox installer
Product: Wine
Version: 1.1.27
Platform: PC
OS/Version: Linux
Status: UNCONFIRMED
Severity: normal
Priority: P2
Component: msi
AssignedTo: wine-bugs(a)winehq.org
ReportedBy: b0ntrict0r(a)yandex.ru
Created an attachment (id=23024)
--> (http://bugs.winehq.org/attachment.cgi?id=23024)
Screenshot that illustrates the problem
Text labels are filled with a template text instead of components description,
installation path, size, etc. in VirtualBox 2.2.4 installer. Text in label (1)
substitutes with proper content after selecting component in the tree, and text
in label (3) substitutes with proper text after selecting installation path in
"Browse" dialog.
--
Configure bugmail: http://bugs.winehq.org/userprefs.cgi?tab=email
Do not reply to this email, post in Bugzilla using the
above URL to reply.
------- You are receiving this mail because: -------
You are watching all bug changes.
http://bugs.winehq.org/show_bug.cgi?id=30773
Bug #: 30773
Summary: Nibud C@shflow Manager 4 not starting
Product: Wine
Version: unspecified
Platform: x86
OS/Version: Linux
Status: UNCONFIRMED
Severity: normal
Priority: P2
Component: -unknown
AssignedTo: wine-bugs(a)winehq.org
ReportedBy: cumulus0007(a)gmail.com
Classification: Unclassified
Nibud C@shflow Manager is an application to manage your finances and personal
budgets.
The application shows a welcome screen, where one can choose to evaluate or to
buy a license. When evaluation is started, it tries to import settings from
other applications. Once this is finished, the application reports an error has
occured and the application must close. No further information is provided.
fixme:ole:CoInitializeSecurity (0x45ae00,-1,(nil),(nil),6,2,(nil),64,(nil)) -
stub!
err:ole:CoGetClassObject class {24e669e1-e90f-4595-a012-b0fd3ccc5c5a} not
registered
err:ole:CoGetClassObject no class object {24e669e1-e90f-4595-a012-b0fd3ccc5c5a}
could be created for context 0x1
p11-kit: couldn't load module:
/usr/lib/i386-linux-gnu/pkcs11/gnome-keyring-pkcs11.so:
/usr/lib/i386-linux-gnu/pkcs11/gnome-keyring-pkcs11.so: kan gedeeld
objectbestand niet openen: Bestand of map bestaat niet
fixme:shell:FileIconInit (true)
fixme:hnetcfg:fw_manager_GetIDsOfNames 0x2ca9e40
{00000000-0000-0000-0000-000000000000} 0x32f880 1 1043 0x32f8c4
fixme:resource:GetGuiResources (0xf8,0): stub
Wine 1.5.5
Linux 3.2.0-24-generic #39-Ubuntu SMP Mon May 21 16:52:17 UTC 2012 x86_64
x86_64 x86_64 GNU/Linux
--
Configure bugmail: http://bugs.winehq.org/userprefs.cgi?tab=email
Do not reply to this email, post in Bugzilla using the
above URL to reply.
------- You are receiving this mail because: -------
You are watching all bug changes.
https://bugs.winehq.org/show_bug.cgi?id=49498
Bug ID: 49498
Summary: In file-open dialog, selecting .lnk shortcut picks
shortcut instead of going to target folder
Product: Wine
Version: 5.11
Hardware: x86
OS: Linux
Status: UNCONFIRMED
Severity: normal
Priority: P2
Component: -unknown
Assignee: wine-bugs(a)winehq.org
Reporter: nyanpasu64(a)tuta.io
Distribution: ---
In a Wine file-open dialog, if you double-click a shortcut to a folder (unsure
about file), it sends the shortcut to the program instead of navigating to the
folder.
OpenMPT is one app which expects you to open a .lnk file in a file-open dialog.
The way I found this bug is:
- Install OpenMPT on Windows or Wine.
- Open the View menu and click Setup.
- Click the Keyboard tab, and click "Import Keys...".
If you double-click "More Keymaps", Windows would go to the .lnk target
directory. But Wine returns the .lnk file from the file-open dialog.
Note that OpenMPT uses XP-style file dialogs on Wine because Wine's Vista-style
file dialogs are terrible.
https://github.com/OpenMPT/openmpt/blob/84428b3666d79d197a7bb9f3a9ece0b2ba2…
On Wine, both XP/Vista dialogs don't traverse the .lnk file and instead return
the .lnk path. On Windows, both XP/Vista dialogs traverse the .lnk file.
MFC defines two types of dialogs with a similar C++ API. XP = Common File
Dialog (I think), Vista = Common Item Dialog (COM-based).
--
Do not reply to this email, post in Bugzilla using the
above URL to reply.
You are receiving this mail because:
You are watching all bug changes.
http://bugs.winehq.org/show_bug.cgi?id=33306
Bug #: 33306
Summary: Wine creates FreeDesktop .desktop files when windows
Desktop shortcuts (lnk files) are created
Product: Wine
Version: 1.5.26
Platform: x86
OS/Version: Mac OS X
Status: UNCONFIRMED
Severity: trivial
Priority: P2
Component: -unknown
AssignedTo: wine-bugs(a)winehq.org
ReportedBy: adman.com(a)gmail.com
Classification: Unclassified
Mac OS X does not support the freedesktop standard for .desktop files, however
Wine attempts to create one anyway when a Windows shortcut (lnk file) is
created by an installer.
This feature should be disabled on Mac OS X, in place of something which can
generate Mac OS X-compatible shortcuts.
--
Configure bugmail: http://bugs.winehq.org/userprefs.cgi?tab=email
Do not reply to this email, post in Bugzilla using the
above URL to reply.
------- You are receiving this mail because: -------
You are watching all bug changes.
https://bugs.winehq.org/show_bug.cgi?id=46207
Bug ID: 46207
Summary: shaders broken in EVE Online
Product: Wine
Version: unspecified
Hardware: x86
OS: Linux
Status: UNCONFIRMED
Severity: normal
Priority: P2
Component: directx-d3dx11
Assignee: wine-bugs(a)winehq.org
Reporter: n.andrew.walsh(a)gmail.com
Distribution: ---
Created attachment 62889
--> https://bugs.winehq.org/attachment.cgi?id=62889
A combat site in EVE, which is surrounded by a giant black cube because of
broken shaders
Setting shaders to "high" quality in the graphics menu causes some shader
elements in EVE Online to render incorrectly. Notably in the new Abyssal sites,
as well as stars, around certain stargates, stations, and in certain anomaly
sites.
Józef Kucia submitted changes to the shaders in 3.16 and 3.17, which was around
when I started having the problem. I'm not sure if it's a regression, or just
work that still needs to be done. I've attached a screenshot to show what it
looks like: rather than a haze or gas-cloud effect, the whole site is
surrounded by a giant black cube. When inside this cube, visibility is poor,
most assets are invisible, and it's difficult to play.
Cheers.
--
Do not reply to this email, post in Bugzilla using the
above URL to reply.
You are receiving this mail because:
You are watching all bug changes.