https://bugs.winehq.org/show_bug.cgi?id=43869
Bug ID: 43869
Summary: FL Studio: Unable to open through wine-staging
Product: Wine
Version: 2.18
Hardware: x86-64
OS: Linux
Status: UNCONFIRMED
Severity: major
Priority: P2
Component: propsys
Assignee: wine-bugs(a)winehq.org
Reporter: troutsound(a)airmail.cc
Distribution: ---
Whenever I attempt to open the FL.exe file through wine-staging 2.14-2.18, I
get a major application error,
--
Do not reply to this email, post in Bugzilla using the
above URL to reply.
You are receiving this mail because:
You are watching all bug changes.
https://bugs.winehq.org/show_bug.cgi?id=45269
Bug ID: 45269
Summary: FL Studio 20.0.0.445: Odd problem possibly indicative
of WINE file-descriptor problem
Product: Wine
Version: 3.9
Hardware: x86-64
OS: Linux
Status: UNCONFIRMED
Severity: major
Priority: P2
Component: -unknown
Assignee: wine-bugs(a)winehq.org
Reporter: iam(a)mcnster.com
Distribution: ---
Howdy folks,
I have install FL Studio 20 in a 64-bit wineprefix.
When I run:
$ wine64 .wine/drive_c/Program\ Files\ \(x86\)/Image-Line/FL\ Studio\
20/FL64.exe
... I receive the following diagnostics which repeats the last line every 60
seconds, forever:
0009:fixme:explorerframe:taskbar_list_SetProgressState iface 0x37bc620, hwnd
0x20126, flags 2 stub!
003e:err:ntdll:RtlpWaitForCriticalSection section 0x1c6d470 "?" wait timed out
in thread 003e, blocked by 0009, retrying (60 sec)
003e:err:ntdll:RtlpWaitForCriticalSection section 0x1c6d470 "?" wait timed out
in thread 003e, blocked by 0009, retrying (60 sec)
YET!
When I run:
$ wine64 [path-to-FL64.exe] 2>&1 | tee run.log
... the program runs as expected with no errors or hang.
Weird, huh?
Two facts to consider, unfortunately: 1) FL Studio 19 worked flawlessly under
wine-staging-3.7, and I don't remember if FL Studio 19 or 20 worked under
wine-staging-3.8, but one of them DIDN'T.
Any help would be appreciated.
--
Do not reply to this email, post in Bugzilla using the
above URL to reply.
You are receiving this mail because:
You are watching all bug changes.
http://bugs.winehq.org/show_bug.cgi?id=36461
Bug ID: 36461
Summary: BgmHkClient crash when clicking on login form
Product: Wine
Version: 1.7.18
Hardware: x86
URL: http://ovear.info/wailian/bgmtest.rar
OS: Linux
Status: NEW
Keywords: download, source
Severity: normal
Priority: P2
Component: -unknown
Assignee: wine-bugs(a)winehq.org
Reporter: fracting(a)gmail.com
Created attachment 48507
--> http://bugs.winehq.org/attachment.cgi?id=48507
Log: console output
BgmHkClient is a dotnet program, using WPF.
To reproduce:
0. pre-request: winetricks -q dotnet40 (not sure if corefonts is needed, I
tested that but doesn't help)
1. Download from http://ovear.info/wailian/bgmtest.rar , uncompress the
software
2. wine BgmHkClient.exe
3. click on the login form (the first form)
4. crash.
Attached console log.
--- quote ---
Unhandled Exception: System.InvalidOperationException: Dispatcher processing
has been suspended, but messages are still being processed.
--- quote ---
These lines make me think of http://bugs.winehq.org/show_bug.cgi?id=32568, but
applying Dan's patch doesn't help, may be not related to that bug, I don't
know.
The author of BgmHkClient may help if needed.
--
Do not reply to this email, post in Bugzilla using the
above URL to reply.
You are receiving this mail because:
You are watching all bug changes.
https://bugs.winehq.org/show_bug.cgi?id=44800
Bug ID: 44800
Summary: FL Studio: Attempting to minimize FL Studio shows a
small label instead
Product: Wine
Version: 3.4
Hardware: x86-64
OS: Linux
Status: UNCONFIRMED
Severity: minor
Priority: P2
Component: -unknown
Assignee: wine-bugs(a)winehq.org
Reporter: ajduck(a)outlook.com
Distribution: ---
Created attachment 60833
--> https://bugs.winehq.org/attachment.cgi?id=60833
Terminal output (with notes)
When you attempt to minimize FL Studio, instead of minimizing, a small label
separate from the main window appears instead. If the main FL Studio window is
maximized when you attempt to minimize it, it doesn't change size, but if it's
not maximized the window is resized to a small square.
The contents of the main window after attempting to minimize is an after image
of what was rendered before minimizing, apart from a small section of the top
left corner of the application (which is just a after image of the minimize
button). If you change the size of the window in this state it shows a
trailing/ghost effect (think IE6 effect) of whatever is behind the window, e.g.
the desktop background.
I set the severity to minor because it makes minimizing the window
inconvenient, however there is a simple workaround: either use the keyboard
shortcut for minimizing on the small label window, or click on the taskbar
button/dock icon for FL Studio several times as necessary. FL Studio then
properly minimizes.
I've tested on elementary OS (Pantheon) and Fedora (GNOME 3) with Wine 3.4 and
it happens on both.
On Windows, when minimizing under normal usage you don't see this label,
however if you rapidly minimize and restore FL Studio you can very briefly see
it. With this in mind it might be that the label itself is normal behavior but
it's supposed to immediately disappear or minimize.
I attached the terminal log (with some notes). I'll attach some footage soon.
======
FL Studio 12 Demo:
https://support.image-line.com/redirect/FLStudio_Installer_Google
The demo and the full version are the same executable.
--
Do not reply to this email, post in Bugzilla using the
above URL to reply.
You are receiving this mail because:
You are watching all bug changes.
https://bugs.winehq.org/show_bug.cgi?id=47909
Bug ID: 47909
Summary: OTT VST "works" but does not render in FL Studio 20.
Product: Wine
Version: 4.15
Hardware: x86-64
OS: Linux
Status: UNCONFIRMED
Severity: normal
Priority: P2
Component: -unknown
Assignee: wine-bugs(a)winehq.org
Reporter: demian.l.ihrig(a)gmail.com
Distribution: ---
Created attachment 65405
--> https://bugs.winehq.org/attachment.cgi?id=65405
Ott "working" but not rendering
The Xfer records OTT VST doesn't render when loading it up in FL Studio 20. The
window for it has the right dimensions and the effect itself still works. I can
even load up project files from a windows machine that were preconfigured and
they will work just fine I just don't have a UI for it (see attachment).
I also ran fl in the terminal and this was the suspect line that popped up in
the terminal when I loaded OTT:
002a:fixme:vulkan:X11DRV_vkCreateWin32SurfaceKHR Application requires child
window rendering, which is not implemented yet!
P.S. Forgive me for any ambiguities and the like, this is my very first bug
report.
--
Do not reply to this email, post in Bugzilla using the
above URL to reply.
You are receiving this mail because:
You are watching all bug changes.
https://bugs.winehq.org/show_bug.cgi?id=49263
Bug ID: 49263
Summary: ME3Explorer hangs on start in 5.9
Product: Wine
Version: 5.9
Hardware: x86-64
URL: https://github.com/ME3Tweaks/ME3Explorer/releases/tag/
4.1.1.314
OS: Linux
Status: UNCONFIRMED
Severity: normal
Priority: P2
Component: dwrite
Assignee: wine-bugs(a)winehq.org
Reporter: mirh(a)protonmail.ch
Regression SHA1: c8f409ed9311c6b84b2383ac5640ad39cfb1d5e5
Distribution: ---
.NET 4.8 and workaround for bug 45871 are required too.
--
Do not reply to this email, post in Bugzilla using the
above URL to reply.
You are receiving this mail because:
You are watching all bug changes.
http://bugs.winehq.org/show_bug.cgi?id=12059
Summary: Help window cannot be closed
Product: Wine
Version: 0.9.57.
Platform: Other
URL: http://chariot.tucows.com/files7/flstudio7_RC6b.exe
OS/Version: other
Status: UNCONFIRMED
Severity: normal
Priority: P2
Component: -unknown
AssignedTo: wine-bugs(a)winehq.org
ReportedBy: jeffzaroyko(a)gmail.com
When running Fruity Loops studio, accessing any help functions brings up a help
window which cannot be closed and stays as the top most window.
steps to reproduce:
rm -rf ~/.wine
wget -c http://chariot.tucows.com/files7/flstudio7_RC6b.exe
wine flstudio7_RC6b.exe
cp mfc42.dll ~/.wine/drive_c/windows/system32
cd .wine/drive_c/Program\ Files/Image-Line/FL\ Studio\ 7/
wine FL.exe
--
Configure bugmail: http://bugs.winehq.org/userprefs.cgi?tab=email
Do not reply to this email, post in Bugzilla using the
above URL to reply.
------- You are receiving this mail because: -------
You are watching all bug changes.
http://bugs.winehq.org/show_bug.cgi?id=14957
Summary: FL Studio fails to minimize
Product: Wine
Version: 1.1.3
Platform: PC
OS/Version: Linux
Status: UNCONFIRMED
Severity: enhancement
Priority: P2
Component: -unknown
AssignedTo: wine-bugs(a)winehq.org
ReportedBy: billstei(a)hbci.com
FL Studio does not use the normal window manager minimize/maximize/close
buttons, and attempts to programmatically invoke these functions via the FL
Studio user interface. Specifically, minimizing fails under Gnome 2.22.3,
resulting in the main FL Studio window disappearing momentarily and then
reappearing.
--
Configure bugmail: http://bugs.winehq.org/userprefs.cgi?tab=email
Do not reply to this email, post in Bugzilla using the
above URL to reply.
------- You are receiving this mail because: -------
You are watching all bug changes.
http://bugs.winehq.org/show_bug.cgi?id=23092
Summary: FL Studio built-in file browser fails with long
pathnames and/or long filenames
Product: Wine
Version: 1.2-rc2
Platform: x86
URL: http://www.flstudio.com
OS/Version: Linux
Status: UNCONFIRMED
Severity: normal
Priority: P2
Component: -unknown
AssignedTo: wine-bugs(a)winehq.org
ReportedBy: billstei(a)hbci.com
To test for this bug: Using FL Studio 9.1 use the browser window (F8 to
open/close this window) to go to Packs->Legacy->SimSynth->Instruments->Simple
Synth Bass_s, and either left click (which plays a preview of the sound), or
right click (which produces a pop-up menu, both of which intermittently fail.
Short paths and/or filenames never fail that I can see (for example try both
left or right clicking on "Rock moog_s" directly above the test link/file. I
have not been able to reproduce this bug in Windows XP, so at this point it
would seem to be Wine related.
--
Configure bugmail: http://bugs.winehq.org/userprefs.cgi?tab=email
Do not reply to this email, post in Bugzilla using the
above URL to reply.
------- You are receiving this mail because: -------
You are watching all bug changes.
http://bugs.winehq.org/show_bug.cgi?id=14554
Summary: FLSynthmaker menus show up on the wrong screen in
Xinerama mode
Product: Wine
Version: 1.1.1
Platform: PC
URL: http://www.flstudio.com/documents/download.html
OS/Version: Linux
Status: NEW
Keywords: download
Severity: minor
Priority: P2
Component: -unknown
AssignedTo: wine-bugs(a)winehq.org
ReportedBy: thestig(a)google.com
While testing out bug 14536 on a computer with dual monitors, I started
FLSynthmaker and its window opened on the right screen, but when I click on the
menu, the menu popped up on the left screen. This made mouse navigation
impossible, so I had to use the arrow keys to move around the menu.
--
Configure bugmail: http://bugs.winehq.org/userprefs.cgi?tab=email
Do not reply to this email, post in Bugzilla using the
above URL to reply.
------- You are receiving this mail because: -------
You are watching all bug changes.
http://bugs.winehq.org/show_bug.cgi?id=14536
Summary: FLSynthmaker crashes FL Studio
Product: Wine
Version: CVS/GIT
Platform: PC
OS/Version: Linux
Status: UNCONFIRMED
Severity: normal
Priority: P2
Component: gdiplus
AssignedTo: wine-bugs(a)winehq.org
ReportedBy: billstei(a)hbci.com
Inside the FL Studio program ( demo here:
http://www.flstudio.com/documents/download.html ) go to menu Channels-->Add
one-->Synthmaker and FL Studio crashes with the following error message (using
WINEDEBUG+=gdiplus):
trace:gdiplus:GdipCreateBitmapFromScan0 32767 32767 0 925707 (nil) 0x32bf18
err:bitmap:X11DRV_DIB_SetImageBits Out of memory!
X Error of failed request: BadAlloc (insufficient resources for operation)
Major opcode of failed request: 53 (X_CreatePixmap)
Serial number of failed request: 30719
Current serial number in output stream: 30722
--
Configure bugmail: http://bugs.winehq.org/userprefs.cgi?tab=email
Do not reply to this email, post in Bugzilla using the
above URL to reply.
------- You are receiving this mail because: -------
You are watching all bug changes.
http://bugs.winehq.org/show_bug.cgi?id=20805
Summary: FL Studio and MIDI Controller
Product: Wine
Version: 1.1.32
Platform: PC
URL: http://flstudio.image-line.com/
OS/Version: Linux
Status: UNCONFIRMED
Severity: normal
Priority: P3
Component: -unknown
AssignedTo: wine-bugs(a)winehq.org
ReportedBy: benjee.d(a)gmail.com
I have installed FL studio 9.
The problem is connecting an ALESIS PHOTON 25 ( midi controller by USB port )
no message is showed, but FL studio seems to not receiving midi signal, and is
impossible to link the knobs and buttons, with this program interface.
FL stduio includes one configuration tool to find midi devices, but nothing
happens using it.
--
Configure bugmail: http://bugs.winehq.org/userprefs.cgi?tab=email
Do not reply to this email, post in Bugzilla using the
above URL to reply.
------- You are receiving this mail because: -------
You are watching all bug changes.
http://bugs.winehq.org/show_bug.cgi?id=23859
Summary: FL Studio plugins add semicolon to saved file names
Product: Wine
Version: 1.2
Platform: x86
URL: http://www.flstudio.com
OS/Version: Linux
Status: UNCONFIRMED
Severity: normal
Priority: P2
Component: -unknown
AssignedTo: wine-bugs(a)winehq.org
ReportedBy: billstei(a)hbci.com
In the program FL Studio (9.1) some of the synth plugins add an extraneous
suffix (semicolon) to the end of the file name. Example: Add the Toxic
Biohazard plugin using menu CHANNELS->Add one->Toxic Biohazard. Now save a
preset using the synth GUI (slightly right of top center on the GUI):
OPTIONS->Save Program, which calls up a standard Windows File Save dialog
window. If I use the name "MyPreset", the extension ".tbio" is added with an
additional semicolon, so that the resulting file name is now "MyPreset.tbio;".
This is probably a bug in Toxic Biohazard, given that not all FL Studio plugins
(e.g. Sytrus) exhibit this behaviour, but this bad behaviour is probably
masked/corrected by Windows, and if so, then perhaps Wine should also
mask/correct it.
--
Configure bugmail: http://bugs.winehq.org/userprefs.cgi?tab=email
Do not reply to this email, post in Bugzilla using the
above URL to reply.
------- You are receiving this mail because: -------
You are watching all bug changes.
http://bugs.winehq.org/show_bug.cgi?id=29611
Bug #: 29611
Summary: FL Studio 10 is invisible without "emulate virtual
desktop"
Product: Wine
Version: 1.3.37
Platform: x86-64
OS/Version: Linux
Status: UNCONFIRMED
Severity: normal
Priority: P2
Component: -unknown
AssignedTo: wine-bugs(a)winehq.org
ReportedBy: realnc(a)gmail.com
Classification: Unclassified
When running FL Studio (version 10), the main application window is invisible.
To clarify: it's not that an empty window appears or something like that.
Instead, nothing appears except the initial pop-up dialog of FL Studio that
informs you that this is a demo. The only thing that's visible is the task
manager entry in KDE's task manager panel.
When enabling "Emulate a virtual desktop" in winecfg, then the application
shows up correctly.
I'm using Wine 1.3.37 on Gentoo Linux AMD64, using the Radeon graphics driver
(Gallium3D with KMS, Mesa 7.11.2 and also tried latest Git version.)
When trying to reproduce, you can download FL Studio from here:
http://flstudio.image-line.com/documents/download.html
It's a free download (224MB) and you don't need to sign-up or anything.
--
Configure bugmail: http://bugs.winehq.org/userprefs.cgi?tab=email
Do not reply to this email, post in Bugzilla using the
above URL to reply.
------- You are receiving this mail because: -------
You are watching all bug changes.
http://bugs.winehq.org/show_bug.cgi?id=30132
Bug #: 30132
Summary: Not work FL Studio in latest wine
Product: Wine
Version: 1.4-rc6
Platform: x86
OS/Version: Linux
Status: UNCONFIRMED
Severity: normal
Priority: P2
Component: -unknown
AssignedTo: wine-bugs(a)winehq.org
ReportedBy: mikhail.v.gavrilov(a)gmail.com
Classification: Unclassified
Then I launch FL Studio throw exception in console:
mikhail@p5k:~$ .wine/drive_c/Program\ Files/Image-Line/FL\ Studio\ 10/FL.exe
err:seh:setup_exception_record stack overflow 904 bytes in thread 0009 eip
7ef93dce esp 00230fa8 stack 0x230000-0x231000-0x330000
FL Studio you can get here:
http://demodownload.image-line.com/flstudio/flstudio_10.0.9.exe
--
Configure bugmail: http://bugs.winehq.org/userprefs.cgi?tab=email
Do not reply to this email, post in Bugzilla using the
above URL to reply.
------- You are receiving this mail because: -------
You are watching all bug changes.
http://bugs.winehq.org/show_bug.cgi?id=12279
Summary: wine not accepting regcode of FL Studio 8
Product: Wine
Version: 0.9.58.
Platform: Other
OS/Version: Linux
Status: UNCONFIRMED
Severity: normal
Priority: P2
Component: -unknown
AssignedTo: wine-bugs(a)winehq.org
ReportedBy: dianat100(a)yahoo.com
Wine doesn't accept the regcode of FL Studio 8 and the program appears in demo
mode. It does, however accept FL Studio 7 regcode. Regcodes work fine under
Windows XP.
--
Configure bugmail: http://bugs.winehq.org/userprefs.cgi?tab=email
Do not reply to this email, post in Bugzilla using the
above URL to reply.
------- You are receiving this mail because: -------
You are watching all bug changes.
https://bugs.winehq.org/show_bug.cgi?id=46055
Bug ID: 46055
Summary: FL Studio 20: Built-in file browser incorrectly shows
image files alongside plugins in plugin database
Product: Wine
Version: 3.18
Hardware: x86-64
OS: Linux
Status: UNCONFIRMED
Severity: minor
Priority: P2
Component: -unknown
Assignee: wine-bugs(a)winehq.org
Reporter: ajduck(a)outlook.com
Distribution: ---
Created attachment 62640
--> https://bugs.winehq.org/attachment.cgi?id=62640
What it should look like (on Windows)
FL Studio has a built-in file browser on the left. It can be used to load
plugins in a folder called "plugin database". The plugins can have images
associated with them that show as thumbnails.
A basic description of how this works: when FL is installed or first used a
folder called "plugin database" is created (the default location is
~/Documents/Image-Line/FL Studio/Presets/Plugin database/). In either "Effects"
or "Generators", for each plugin there is a set of 3 files: .fst, .png and
.nfo.
The .fst is a FL Studio state file and is the file that loads the plugin. The
.png is the thumbnail for the plugin. The .nfo (which has the same name as the
.fst) basically points to the image and probably all of them contain only
"Bitmap=Plugin.png".
On Windows, the plugin database folder viewed from FL's file browser only lists
the .fst files (with the pictures shown as a thumbnail for the .fst file) and
hides the actual .png files that are referred to in the .nfo. See "What it
should look like (on Windows)" image attached.
On Wine, the plugin database folder doesn't replicate this behaviour and lists
the .png files alongside the .fst files. See "What it shouldn't look like (on
Wine)" image.
Steps to reproduce:
1. Download FL Studio (link at bottom of this post) and install it. Skip
ASIO4ALL installation if it comes up.
2. Open FL. It will load a project file on first startup. You can either just
stay on that or go to File > New (if there's no text, press F12 -> F3 -> n, if
a prompt comes up press n again).
3. On the left is the file browser sidebar. Click the button that has a plug
icon (the last button of three) at the top of that sidebar.
4. Click on either the "Effects" or "Generators" folders, and then click on one
of the subfolders. The .png files will be in the list, which doesn't happen on
Windows.
Tested in a clean wineprefix.
OS: elementary OS 5.0 Juno (based on Ubuntu 18.04)
Tested on Wine 3.19 but 3.18 also had this bug.
----------
Download link:
http://demodownload.image-line.com/flstudio/flstudio_win_20.0.5.681.exe
$ sha1sum flstudio_win_20.0.5.681.exe
11901b66a65c526203dacbab7ec6a3c61edb1553 flstudio_win_20.0.5.681.exe
--
Do not reply to this email, post in Bugzilla using the
above URL to reply.
You are receiving this mail because:
You are watching all bug changes.
http://bugs.winehq.org/show_bug.cgi?id=35193
Bug ID: 35193
Summary: FL Studio 11.x VSTi 'Slayer2' plugin doesn't work
after registration (ASProtect 1.4 software protection)
Product: Wine
Version: 1.7.9
Hardware: x86
OS: Linux
Status: NEW
Severity: normal
Priority: P2
Component: -unknown
Assignee: wine-bugs(a)winehq.org
Reporter: focht(a)gmx.net
Classification: Unclassified
Hello folks,
a user in #winehq reported another plugin not working with FL 11.x (after
fixing bug 35178).
Plugin download:
http://downloads.image-line.com/slayer/slayer2_personalcopy_install.exe
Interestingly: http://www.image-line.com/documents/slayer.html
--- quote ---
FL Slayer2 is no longer available for purchase.
Existing registered customers will keep receiving support.
--- quote ---
Running 'VerA' (a specific tool to identify ASProtect versions) on the plugin
main dll 'Slayer2.dll' reveals:
--- snip ---
EntryPoint check: ASProtect .DLL style
Crypto info: Block type: 1(U), Info type: 1, Attempts: 1
Application name: Slayer 2
Application version: 1.0
ASProtect version: 1.4 build 04.01 Beta
ASProtect registered to: Image-Line Software
raw info data: [Slayer 2], [1.0], [1.4 build 04.01 Beta], [Image-Line Software]
--- snip ---
The plugin needs to be registered with license code to reproduce the problem
(the user has a legit license).
The protector decrypts the actual plugin code only with a valid license code
during dll initialization.
The 'plugin interface' dll export 'main' is redirected to real code which is
later called by the hosting application -> FL11.
In non-registered version the plugin dll export 'main' is just a stub,
returning zero:
--- snip ---
0024:Ret PE DLL (proc=0x10170001,module=0x10000000
L"Slayer2.dll",reason=PROCESS_ATTACH,res=(nil)) retval=1
0024:Ret KERNEL32.LoadLibraryA() retval=10000000 ret=7ede9e5e
0024:Call KERNEL32.GetProcAddress(10000000,7edf0f5b "VSTPluginMain")
ret=7ede9f1e
0024:Ret KERNEL32.GetProcAddress() retval=00000000 ret=7ede9f1e
0024:Call KERNEL32.GetProcAddress(10000000,7edf0f69 "VstPluginMain")
ret=7ede9f42
0024:Ret KERNEL32.GetProcAddress() retval=00000000 ret=7ede9f42
0024:Call KERNEL32.GetProcAddress(10000000,7edf0f77 "main") ret=7ede9f66
0024:Ret KERNEL32.GetProcAddress() retval=1000bd70 ret=7ede9f66
0024:Call KERNEL32.FreeLibrary(10000000) ret=7ede8d31
0024:Call PE DLL (proc=0x10170001,module=0x10000000
L"Slayer2.dll",reason=PROCESS_DETACH,res=(nil))
...
RemotePlugin::DebugMessage: mainEntry prodecure returned NULL
--- snip ---
The protector doesn't like relay thunks (WINEDEBUG=+relay), it will refuse to
load further at some point, showing 'Error 198'.
When you simply run it within FL11 it will spit out the following messages on
terminal before dying:
--- snip ---
...
fixme:mountmgr:harddisk_ioctl Unsupported ioctl 4d004 (device=4 access=3
func=401 method=0)
fixme:mountmgr:harddisk_ioctl Unsupported ioctl 4d004 (device=4 access=3
func=401 method=0)
err:seh:setup_exception_record stack overflow 896 bytes in thread 0024 eip
7bc43cc2 esp 00240fb0 stack 0x240000-0x241000-0x340000
--- snip ---
Since the user expressed interest to investigate this problem I will back off
for now ;-)
Just a hint for making analysis easier:
Write a small winelib app that acts as loader/host to avoid running the rather
large/complex FL Studio 11.x
Calling 'LoadLibraryA("Slayer2.dll")' is sufficient.
All the magic happens within dll entry point (attach event).
===
I will happily leave any bugs to people wanting to do their own analysis for
fun/learning experience.
Just indicate it: "I'm working on this" ... "I'll have a look" and I'll skip
that bug (there are still thousands of bugs not analysed yet) ;-)
Regards
--
Do not reply to this email, post in Bugzilla using the
above URL to reply.
You are receiving this mail because:
You are watching all bug changes.
http://bugs.winehq.org/show_bug.cgi?id=35178
Bug ID: 35178
Summary: FL Studio 11.x 'DirectWave' plugin doesn't work
(unsupported FSCTL_IS_VOLUME_MOUNTED ioctl)
Product: Wine
Version: 1.7.8
Hardware: x86
OS: Linux
Status: NEW
Severity: normal
Priority: P2
Component: -unknown
Assignee: wine-bugs(a)winehq.org
Reporter: focht(a)gmx.net
Classification: Unclassified
Hello folks,
a user in #winehq reported this.
I was able to reproduce the problem with the demo version of FL 11 using the
following recipe (quoting IRC log):
--- quote ---
<alexmarkley> i am running into an issue with FL Studio 11 running on Linux
under Wine 1.7.8
<alexmarkley> most everything appears to be working, but there are a couple of
important software instrument plugins that fail to load any sounds
...
<alexmarkley> focht: File -> New from template -> Minimal -> Basic with limiter
<alexmarkley> focht: sub-window "Pattern 1", right click "Kick" -> Insert ->
DirectWave
<alexmarkley> focht: in the DirectWave window which appears, click the down
arrow next to "Select Preset"
<alexmarkley> focht: if you don't have any DirectWave presets, you can download
a free one
<alexmarkley> from within the GUI there
<alexmarkley> anyway, once you select the preset you will see it loads the
program, but clicking the piano keys results in no sound
<alexmarkley> focht: you will also notice that, in the loaded program, each
entry in the "Size" column is zero
<alexmarkley> focht: which is bad... in native windows (running in VirtualBox)
i see non-zero values for every one of those entries
--- quote ---
Relevant part of trace log:
--- snip ---
$ pwd
/home/focht/.wine/drive_c/Program Files/Image-Line/FL Studio 11
$ WINEDEBUG=+tid,+seh,+relay wine ./FL.exe >>log.txt 2>&1
...
0024:Call KERNEL32.LoadLibraryW(006ec0fc L"C:\\Program Files\\Image-Line\\FL
Studio 11\\Plugins\\Fruity\\Generators\\DirectWave\\DirectWave.dll")
ret=00e4a66a
0024:Call PE DLL (proc=0xbe7eca6,module=0xbe20000
L"DirectWave.dll",reason=PROCESS_ATTACH,res=(nil))
...
0024:Call KERNEL32.ExpandEnvironmentStringsA(02a447c8 "C:\\Program
Files\\Image-Line\\FL Studio
6\\Data\\Patches\\Packs\\SampleFusion\\Orchestral\\Strings\\Mellotron_02\\SYM_STR_C_2.wav",0033a07c,00000fff)
ret=0be383ea
0024:Ret KERNEL32.ExpandEnvironmentStringsA() retval=00000078 ret=0be383ea
...
0024:Call KERNEL32.CreateFileA(0033ae28
"\\\\.\\C:",80000000,00000007,00000000,00000003,00000000,00000000) ret=0be59e4d
...
0024:Ret KERNEL32.CreateFileA() retval=000001f0 ret=0be59e4d
...
0024:Call
KERNEL32.DeviceIoControl(000001f0,00090028,00000000,00000000,00000000,00000000,0033ae24,00000000)
ret=0be59e8e
...
0024:Ret KERNEL32.DeviceIoControl() retval=00000000 ret=0be59e8e
...
0024:Call KERNEL32.GetLastError() ret=0be59e98
0024:Ret KERNEL32.GetLastError() retval=00000032 ret=0be59e98
--- snip ---
The 'DirectWave' plugin library uses FSCTL_IS_VOLUME_MOUNTED ioctl to check if
the specified volume is mounted before accessing each file (track).
Wine doesn't implement/stub that ioctl hence the failure, resulting in tracks
listed with zero size (as reported).
MSDN:
http://msdn.microsoft.com/en-us/library/windows/desktop/aa364574%28v=vs.85%…
--- quote ---
FSCTL_IS_VOLUME_MOUNTED control code
Determines whether the specified volume is mounted, or if the specified file or
directory is on a mounted volume.
To perform this operation, call the DeviceIoControl function with the following
parameters.
BOOL DeviceIoControl(
(HANDLE) hDevice, // handle to device
FSCTL_IS_VOLUME_MOUNTED, // dwIoControlCode
NULL, // lpInBuffer
0, // nInBufferSize
NULL, // lpOutBuffer
0, // nOutBufferSize
(LPDWORD) lpBytesReturned, // number of bytes returned
(LPOVERLAPPED) lpOverlapped // OVERLAPPED structure
);
...
Return value
If the volume is currently mounted, DeviceIoControl returns a nonzero value.
Otherwise, DeviceIoControl returns zero (0). To get extended error information,
call GetLastError.
Remarks
The NTFS file system treats a locked volume as a dismounted volume. Therefore,
this call returns zero (0) after a volume is locked on the NTFS file system.
--- quote ---
For quick test I short-circuited the ioctl handling on the client side (ntdll)
like the existing FSCTL_LOCK_VOLUME and FSCTL_UNLOCK_VOLUME cases, returning
'success'.
It made the plugin happy and the wav files were correctly loaded/processed.
A more thorough solution is probably enhancing server/mountmgr.
Source:
http://source.winehq.org/git/wine.git/blob/5ba7f79bad4f4832d98d0f2897aea697…
--- snip ---
1495 NTSTATUS WINAPI NtFsControlFile(HANDLE handle, HANDLE event,
PIO_APC_ROUTINE apc,
1496 PVOID apc_context, PIO_STATUS_BLOCK io, ULONG code,
1497 PVOID in_buffer, ULONG in_size, PVOID out_buffer, ULONG
out_size)
1498 {
...
1509 switch(code)
1510 {
1511 case FSCTL_DISMOUNT_VOLUME:
...
1517 case FSCTL_PIPE_PEEK:
1518 {
...
1590 case FSCTL_LOCK_VOLUME:
1591 case FSCTL_UNLOCK_VOLUME:
1592 FIXME("stub! return success - Unsupported fsctl %x (device=%x
access=%x func=%x method=%x)\n",
1593 code, code >> 16, (code >> 14) & 3, (code >> 2) & 0xfff, code
& 3);
1594 status = STATUS_SUCCESS;
1595 break;
...
1619 case FSCTL_PIPE_LISTEN:
1620 case FSCTL_PIPE_WAIT:
1621 default:
1622 status = server_ioctl_file( handle, event, apc, apc_context, io,
code,
1623 in_buffer, in_size, out_buffer, out_size
);
1624 break;
1625 }
1626
1627 if (status != STATUS_PENDING) io->u.Status = status;
1628 return status;
1629 }
--- snip ---
$ sha1sum flstudio_11.0.4.exe
f9bdc2fb0b8d18ffce90e048b12a0c196d0b82d0 flstudio_11.0.4.exe
$ du -sh flstudio_11.0.4.exe
301M flstudio_11.0.4.exe
$ wine --version
wine-1.7.8-278-g53dc001
Regards
--
Do not reply to this email, post in Bugzilla using the
above URL to reply.
You are receiving this mail because:
You are watching all bug changes.
https://bugs.winehq.org/show_bug.cgi?id=41073
Bug ID: 41073
Summary: Tahoma (?) rendering problems
Product: Wine
Version: 1.9.15
Hardware: x86-64
OS: Linux
Status: UNCONFIRMED
Severity: normal
Priority: P2
Component: -unknown
Assignee: wine-bugs(a)winehq.org
Reporter: public.avatar(a)gmail.com
Distribution: ---
Created attachment 55252
--> https://bugs.winehq.org/attachment.cgi?id=55252
New clean prefix, tahoma looks ugly and broken
I switched from infinality to new cleartype hinting (freertype 2.6.5). After
that I have strange problems with fonts rendering in wine (rest system works
fine). I played a lot with fontconfig settings, but it looks like my actions
don't have impact on tahoma rendering at all.
--
Do not reply to this email, post in Bugzilla using the
above URL to reply.
You are receiving this mail because:
You are watching all bug changes.
https://bugs.winehq.org/show_bug.cgi?id=41737
Bug ID: 41737
Summary: SonicPiPortable.exe crashes with message "scsynth.exe
a rencontré un problème sérieux et doit être fermé".
Product: Wine
Version: 1.9.12
Hardware: x86
OS: Linux
Status: UNCONFIRMED
Severity: normal
Priority: P2
Component: -unknown
Assignee: wine-bugs(a)winehq.org
Reporter: joanluc.laborda(a)free.fr
Distribution: ---
Created attachment 56176
--> https://bugs.winehq.org/attachment.cgi?id=56176
Backtrace from the SonicPiPortable.exe failure
The program has been installed in Wine as a 32 bit prog
It seems the problem comes from a unimplemented function in MSVCR120.dll
--
Do not reply to this email, post in Bugzilla using the
above URL to reply.
You are receiving this mail because:
You are watching all bug changes.
http://bugs.winehq.org/show_bug.cgi?id=28266
Summary: Wise Registry Cleaner: Error message at startup
Product: Wine
Version: 1.3.27
Platform: x86
OS/Version: Linux
Status: UNCONFIRMED
Severity: minor
Priority: P2
Component: -unknown
AssignedTo: wine-bugs(a)winehq.org
ReportedBy: lukasz.wojnilowicz(a)gmail.com
Created an attachment (id=36217)
--> (http://bugs.winehq.org/attachment.cgi?id=36217)
Error message
Steps to reproduce:
1) remove ~/.wine
2) install Wise Registry Cleaner
3) wine WiseRegCleaner.exe
Behaviour:
Error message (See attachment).
Expected behaviour:
No error message.
Terminal output:
fixme:resource:GetGuiResources (0xd4,0): stub
Additional info:
Access violation at address 00456D49 in module 'WiseRegCleaner.exe'. Read of
address 000006BD.
Workaround:
WINEDEBUG=+relay
--
Configure bugmail: http://bugs.winehq.org/userprefs.cgi?tab=email
Do not reply to this email, post in Bugzilla using the
above URL to reply.
------- You are receiving this mail because: -------
You are watching all bug changes.
http://bugs.winehq.org/show_bug.cgi?id=18637
Summary: Nokia Map Loader 2.0 (.NET 3.0 app) needs
DisableProcessWindowsGhosting stub
Product: Wine
Version: 1.1.22
Platform: Other
URL: http://europe.nokia.com/get-support-and-software/produ
ct-support/maps-support/compatibility-and-downloads
OS/Version: other
Status: UNCONFIRMED
Severity: normal
Priority: P2
Component: user32
AssignedTo: wine-bugs(a)winehq.org
ReportedBy: focht(a)gmx.net
Hello,
as it says ...
--- snip ---
System.EntryPointNotFoundException: Unable to find an entry point named
'DisableProcessWindowsGhosting' in DLL 'user32.dll'.
at Lizard.Windows.Native.NativeMethods.DisableProcessWindowsGhosting()
at Lizard.Windows.NonClientBaseForm.OnHandleCreated(EventArgs e)
at System.Windows.Forms.Control.WmCreate(Message& m)
at System.Windows.Forms.Control.WndProc(Message& m)
at System.Windows.Forms.ScrollableControl.WndProc(Message& m)
at System.Windows.Forms.ContainerControl.WndProc(Message& m)
at System.Windows.Forms.Form.WmCreate(Message& m)
at System.Windows.Forms.Form.WndProc(Message& m)
at Lizard.Windows.NonClientBaseForm.WndProc(Message& m)
at System.Windows.Forms.Control.ControlNativeWindow.OnMessage(Message& m)
at System.Windows.Forms.Control.ControlNativeWindow.WndProc(Message& m)
at System.Windows.Forms.NativeWindow.Callback(IntPtr hWnd, Int32 msg, IntPtr
wparam, IntPtr lparam)
--- snip ---
A simple stub is enough.
See: http://msdn.microsoft.com/en-us/library/ms648415.aspx
Regards
--
Configure bugmail: http://bugs.winehq.org/userprefs.cgi?tab=email
Do not reply to this email, post in Bugzilla using the
above URL to reply.
------- You are receiving this mail because: -------
You are watching all bug changes.
https://bugs.winehq.org/show_bug.cgi?id=46278
Bug ID: 46278
Summary: Cisco Jabber 12.5 sends only first letter due to
missing richedit:ITextRange functions
Product: Wine
Version: 4.0-rc1
Hardware: x86
OS: Linux
Status: UNCONFIRMED
Severity: normal
Priority: P2
Component: richedit
Assignee: wine-bugs(a)winehq.org
Reporter: kmaterka(a)wp.pl
Distribution: ---
Cisco Jabber 12.5 installs and starts. Audio/video calls are working fine, but
text messages are not working correctly. Only first letter of the message is
sent, for example if I enter "test" then only "t" is sent to another user.
Probably it is due to missing implementation of these functions:
0009:fixme:richedit:ITextRange_fnSetRange (0x172b2148)->(0 0): stub
0009:fixme:richedit:ITextRange_fnSetRange (0x16f2ab10)->(0 1): stub
0009:fixme:richedit:ITextRange_fnSetRange (0x16f2ab10)->(0 0): stub
0009:fixme:richedit:ITextRange_fnGetEmbeddedObject (0x16f2ab10)->(0x33e6b8):
stub
0009:fixme:richedit:ITextRange_fnSetRange (0x16f2ab10)->(0 1): stub
0009:fixme:richedit:ITextRange_fnSetRange (0x16f2ab10)->(0 1): stub
0009:fixme:richedit:ITextRange_fnMove (0x172b2148)->(1 1 0x33e7f4): stub
I can't test it with native riched20 - Cisco Jabber hangs with this setting.
--
Do not reply to this email, post in Bugzilla using the
above URL to reply.
You are receiving this mail because:
You are watching all bug changes.
https://bugs.winehq.org/show_bug.cgi?id=40614
Bug ID: 40614
Summary: Cisco Jabber 11.6 crashes due to missing
dbghelp.dll.EnumerateLoadedModulesExW
Product: Wine
Version: 1.9.9
Hardware: x86
OS: Linux
Status: UNCONFIRMED
Severity: normal
Priority: P2
Component: dbghelp
Assignee: wine-bugs(a)winehq.org
Reporter: robert.munteanu(a)gmail.com
Distribution: ---
Created attachment 54473
--> https://bugs.winehq.org/attachment.cgi?id=54473
Backtrace
Fresh wine prefix, 32-bit install. After installing Cisco Jabber I get a crash,
backtrace pointing to
Unhandled exception: unimplemented function
dbghelp.dll.EnumerateLoadedModulesExW called in 32-bit code (0x7b43e23c).
--
Do not reply to this email, post in Bugzilla using the
above URL to reply.
You are receiving this mail because:
You are watching all bug changes.
https://bugs.winehq.org/show_bug.cgi?id=40655
Bug ID: 40655
Summary: Cisco Jabber 11.6 spins forever, needs
msvcr120.dll.?_Id@_CurrentScheduler@details@Concurrenc
y@@SAIXZ
Product: Wine
Version: 1.9.10
Hardware: arm
OS: Linux
Status: UNCONFIRMED
Severity: normal
Priority: P3
Component: -unknown
Assignee: wine-bugs(a)winehq.org
Reporter: robert.munteanu(a)gmail.com
Distribution: SUSE
Fresh wine prefix, 32-bit install. After installing Cisco Jabber and starting
it the UI has a spinner which never disappears.
The program generates no backtrace, but the terminal contains the following
interesting line:
wine: Call from 0x7b43d626 to unimplemented function
msvcr120.dll.?_Id@_CurrentScheduler@details@Concurrency@@SAIXZ, aborting
--
Do not reply to this email, post in Bugzilla using the
above URL to reply.
You are receiving this mail because:
You are watching all bug changes.
https://bugs.winehq.org/show_bug.cgi?id=45036
Bug ID: 45036
Summary: Cisco Jabber 11.x crashes on unimplemented function
IPHLPAPI.DLL.GetIpNetTable2
Product: Wine
Version: 3.6
Hardware: x86
OS: Linux
Status: UNCONFIRMED
Severity: normal
Priority: P2
Component: iphlpapi
Assignee: wine-bugs(a)winehq.org
Reporter: paul(a)lemmons.name
Distribution: ---
Created attachment 61159
--> https://bugs.winehq.org/attachment.cgi?id=61159
Console log of failure
wine: Call from 0x7bc51389 to unimplemented function
IPHLPAPI.DLL.GetIpNetTable2, aborting
When attempting to start the Cisco Jabber client
wine: 3.6 Build 527 - Development 448344c5e4 (Apr 20)
--
Do not reply to this email, post in Bugzilla using the
above URL to reply.
You are receiving this mail because:
You are watching all bug changes.
https://bugs.winehq.org/show_bug.cgi?id=37334
Bug ID: 37334
Summary: Cisco Jabber fails to run
Product: Wine
Version: 1.7.27
Hardware: x86
OS: Linux
Status: UNCONFIRMED
Severity: normal
Priority: P2
Component: -unknown
Assignee: wine-bugs(a)winehq.org
Reporter: daniel.masur(a)idealo.de
Created attachment 49647
--> https://bugs.winehq.org/attachment.cgi?id=49647
Console output upon running CiscoJabber.exe
Hi.
As a normal user, after installing ie7 into a fresh .wine folder using:
WINEARCH='win32' winetricks ie7
copying ksuser.dll into system32
and then installing the Cisco Jabber Client using:
WINEARCH='win32' wine msiexec /i CiscoJabberSetup.msi
I get the attached console output when running the following:
bash -c "LC_MESSAGES=C WINEARCH='win32' wine .wine/drive_c/Program\
Files/Cisco\ Systems/Cisco\ Jabber/CiscoJabber.exe"
bash -c "LC_MESSAGES=C ..." for englishifying the console output.
--
Do not reply to this email, post in Bugzilla using the
above URL to reply.
You are receiving this mail because:
You are watching all bug changes.
https://bugs.winehq.org/show_bug.cgi?id=44922
Bug ID: 44922
Summary: Cisco Jabber 11.x crashes on unimplemented function
IPHLPAPI.DLL.GetIpForwardTable2,
Product: Wine
Version: 3.5
Hardware: x86-64
OS: Linux
Status: NEW
Severity: normal
Priority: P2
Component: iphlpapi
Assignee: wine-bugs(a)winehq.org
Reporter: focht(a)gmx.net
Distribution: ---
Hello folks,
extracted from bug 37228 (https://bugs.winehq.org/show_bug.cgi?id=37228#c21)
--- snip ---
$ env WINEPREFIX="/home/xxxxxx/.wine32" wine 'C:\Program Files\Cisco
Systems\Cisco Jabber\CiscoJabber.exe'
...
0009:fixme:shcore:GetDpiForMonitor (0x1, 0, 0x32ef48, 0x32ef44): semi-stub
0009:fixme:netapi32:DsGetDcNameW ((null), (null), (null), (null), 40000000,
0x96ad1dc): stub
0009:fixme:ntdsapi:DsBindW ((null),(null), 0x96ad1d8): stub!
0009:fixme:ntdsapi:DsCrackNamesW : stub
wine: Call from 0x7bc51289 to unimplemented function
IPHLPAPI.DLL.GetIpForwardTable2, aborting
....
--- snip ---
Regards
--
Do not reply to this email, post in Bugzilla using the
above URL to reply.
You are receiving this mail because:
You are watching all bug changes.
https://bugs.winehq.org/show_bug.cgi?id=37228
Bug ID: 37228
Summary: Cisco Jabber will not run
Product: Wine
Version: 1.7.25
Hardware: x86
OS: Linux
Status: UNCONFIRMED
Severity: critical
Priority: P2
Component: -unknown
Assignee: wine-bugs(a)winehq.org
Reporter: davidc502(a)tds.net
Created attachment 49501
--> https://bugs.winehq.org/attachment.cgi?id=49501
Errors when trying to run Jabber through console.
Cisco Jabber does not run after install. A grey screen pops up, but shortly
after am requested to close unresponsive application.
URL to the ciscoJabberSetup.msi ->
http://personalpages.tds.net/~davidc502/Jabber/
See attached for Errors whilst trying to run Jabber in Console window.
--
Do not reply to this email, post in Bugzilla using the
above URL to reply.
You are receiving this mail because:
You are watching all bug changes.
https://bugs.winehq.org/show_bug.cgi?id=42222
Bug ID: 42222
Summary: BCG Month/Year list goes behind date control.
Product: Wine
Version: 2.0-rc5
Hardware: x86
OS: Linux
Status: NEW
Severity: normal
Priority: P2
Component: -unknown
Assignee: wine-bugs(a)winehq.org
Reporter: leslie_alistair(a)hotmail.com
Distribution: ---
Created attachment 56862
--> https://bugs.winehq.org/attachment.cgi?id=56862
Show the control behind the Month picker
Run BCGPControls.exe
Select Time Controls on the left hand side.
In CBCGDataTimeCtrl the group
Use the dropdown arrow to show a Date picker.
Click on the Month/Year header this popup.
The Month/year List now appears behind the Calender.
--
Do not reply to this email, post in Bugzilla using the
above URL to reply.
You are receiving this mail because:
You are watching all bug changes.
http://bugs.winehq.org/show_bug.cgi?id=31874
Bug #: 31874
Summary: this program crash when changing the UI style
Product: Wine
Version: 1.5.14
Platform: x86
OS/Version: Linux
Status: UNCONFIRMED
Severity: normal
Priority: P2
Component: -unknown
AssignedTo: wine-bugs(a)winehq.org
ReportedBy: jactry92(a)gmail.com
Classification: Unclassified
Created attachment 41947
--> http://bugs.winehq.org/attachment.cgi?id=41947
'backtrace.txt' is log produced by wine
I used wine 1.5.14 in Ubuntu 12.04.1 32bit to run this
program('client.exe'):http://222.200.98.151/ubuntu/Downloads/client.tar.gz
And it crash when I try to change the UI style(client the button which was
marked by a red circle in the picture in attachment)
After it crach you can't run it again.In order to reappear it, you can change
the value of 'HKEY_CURRENT_USER/Software/ChinaGDS/S2000/JySvr1/UI' to '0'.
'backtrace.txt' is log produced by wine
This is output information in console:
$ wine client.exe
fixme:wbemprox:client_security_SetBlanket 0x442fcd80, 0x13dd68, 10, 0, (null),
3, 3, (nil), 0x00000000
fixme:wbemprox:client_security_Release 0x442fcd80
fixme:process:GetProcessWorkingSetSize (0xffffffff,0x328ed8,0x328edc): stub
wine: Unhandled page fault on read access to 0x00000020 at address 0x4b0b0f
(thread 0025), starting debugger...
--
Configure bugmail: http://bugs.winehq.org/userprefs.cgi?tab=email
Do not reply to this email, post in Bugzilla using the
above URL to reply.
------- You are receiving this mail because: -------
You are watching all bug changes.
http://bugs.winehq.org/show_bug.cgi?id=30378
Bug #: 30378
Summary: Xuzhou
Product: Wine
Version: 1.5.1
Platform: x86
OS/Version: Linux
Status: UNCONFIRMED
Severity: normal
Priority: P2
Component: -unknown
AssignedTo: wine-bugs(a)winehq.org
ReportedBy: fracting(a)gmail.com
Classification: Unclassified
1. Download Xuzhou network client (徐州电信校园网拨号软件v1.1) from:
http://fb.86516.com/adsl/adslrj_files/xiaoyuanDialNew%20v1.1.rar
Unpack the rar archive give us:
校园网认证拨号客户端 v1.1.msi
2. install dependencies for 校园网认证拨号客户端 v1.1.msi :
$ winetricks mfc42
Copy native npptools from WinXP
3. install the network client:
$ LC_CTYPE=en_US.utf8 msiexec /i 校 园网认证拨号客户端\ v1.1.msi
(Bug 10063)
4. start the network client:
$ cd ~/.wine/drive_c/windows/system32
$ wine VnetPPPOE.EXE
Actual result:
Crash
Expect result:
Display the network client GUI
Override native rasapi32.dll + rasman.dll will avoid the crashing
--
Configure bugmail: http://bugs.winehq.org/userprefs.cgi?tab=email
Do not reply to this email, post in Bugzilla using the
above URL to reply.
------- You are receiving this mail because: -------
You are watching all bug changes.
http://bugs.winehq.org/show_bug.cgi?id=30379
Bug #: 30379
Summary: Xuzhou network client error while trying to connect:
"Failed to create VPN dynamic, code = 1060"
Product: Wine
Version: 1.5.1
Platform: x86
OS/Version: Linux
Status: UNCONFIRMED
Severity: normal
Priority: P2
Component: -unknown
AssignedTo: wine-bugs(a)winehq.org
ReportedBy: fracting(a)gmail.com
Classification: Unclassified
[reply] [-] Description Qian Hong 2012-04-08 05:21:16 CDT
1. Download Xuzhou network client (徐州电信校园网拨号软件v1.1) from:
http://fb.86516.com/adsl/adslrj_files/xiaoyuanDialNew%20v1.1.rar
Unpack the rar archive give us:
校园网认证拨号客户端 v1.1.msi
2. install dependencies for 校园网认证拨号客户端 v1.1.msi :
$ winetricks mfc42
Copy native npptools from WinXP
3. install the network client:
$ LC_CTYPE=en_US.utf8 msiexec /i 校 园网认证拨号客户端\ v1.1.msi
(Bug 10063)
4. Override native rasapi32.dll + rasman.dll, workarounds Bug 30378.
5. start the network client:
$ cd ~/.wine/drive_c/windows/system32
$ wine VnetPPPOE.EXE
Actual result:
Popup an error message, complaining "Failed to create VPN dynamic, code =
1060".
(In Chinese: 动态创建VPN失败, code = 1060 )
Console log is like below:
err:rpc:I_RpcGetBuffer no binding
err:rpc:I_RpcGetBuffer no binding
err:rpc:I_RpcGetBuffer no binding
fixme:rtutils:TraceRegisterExW (L"RASAPI32", 0): stub
fixme:rtutils:TraceRegisterExW (L"RASAPI32", 0): stub
fixme:rtutils:TraceRegisterExW (L"RASAPI32", 0): stub
fixme:rtutils:TraceRegisterExW (L"RASAPI32", 0): stub
fixme:rtutils:TraceRegisterExW (L"RASAPI32", 0): stub
fixme:rtutils:TraceRegisterExW (L"RASAPI32", 0): stub
fixme:rtutils:TraceRegisterExW (L"RASAPI32", 0): stub
Expect result:
Trying to connect to the authentication server
Addition info:
1. If I modified the TraceRegisterExW function to return TRACE_USE_CONSOLE or
TRACE_USE_FILE rather then INVALID_TRACEID, then the application will go a bit
further and crash on unimplemented function rtutils.dll.TracePrintfA() .
2. Native rtutils.dll won't give me any more luck, a snoop trace show that
rtutils.dll.TracePrintfA() is called, then RASAPI32.RasSetEntryPropertiesA(),
then nothing happen...
Will retest once Bug 30378 is fixed
--
Configure bugmail: http://bugs.winehq.org/userprefs.cgi?tab=email
Do not reply to this email, post in Bugzilla using the
above URL to reply.
------- You are receiving this mail because: -------
You are watching all bug changes.
http://bugs.winehq.org/show_bug.cgi?id=30041
Bug #: 30041
Summary: npptools.dll is needed by ishare_user.exe of Dr.com
Product: Wine
Version: 1.4-rc5
Platform: x86
OS/Version: Linux
Status: UNCONFIRMED
Severity: normal
Priority: P2
Component: -unknown
AssignedTo: wine-bugs(a)winehq.org
ReportedBy: fracting(a)gmail.com
Classification: Unclassified
1. Download Dr.comhttp://www.cqjtu.edu.cn/software/Dr.COM%20Client-%E9%87%8D%E5%BA%86%E4%BA%A…
2. Install drcom.exe
3. install mfc42 with winetricks
4. start ishare_user.exe
$ wine ishare_user.exe
err:module:import_dll Library NPPTools.dll (which is needed by
L"C:\\windows\\system32\\packet.dll") not found
err:module:import_dll Library packet.dll (which is needed by L"C:\\Program
Files\\Dr.COM \5bbd\5e26\8ba4\8bc1\5ba2\6237\7aef\\ishare_user.exe") not found
err:module:LdrInitializeThunk Main exe initialization for L"C:\\Program
Files\\Dr.COM \5bbd\5e26\8ba4\8bc1\5ba2\6237\7aef\\ishare_user.exe" failed,
status c0000135
Dr.com is important for some university students, see also
http://bugs.winehq.org/show_bug.cgi?id=29460#c2
I've tried native npptools.dll, it may work but I'm not sure since I have no
network environment for testing.
--
Configure bugmail: http://bugs.winehq.org/userprefs.cgi?tab=email
Do not reply to this email, post in Bugzilla using the
above URL to reply.
------- You are receiving this mail because: -------
You are watching all bug changes.
http://bugs.winehq.org/show_bug.cgi?id=32305
Bug #: 32305
Summary: Dr.com response slowly when clicking on menu
Product: Wine
Version: 1.5.17
Platform: x86
OS/Version: Linux
Status: NEW
Severity: normal
Priority: P2
Component: -unknown
AssignedTo: wine-bugs(a)winehq.org
ReportedBy: fracting(a)gmail.com
Classification: Unclassified
Hello, this bug is found when testing on Bug 32289, it's introduced by the
following commit:
$ git bisect bad
7304445a7efa9f30e4541b075a2022319f291e4e is the first bad commit
commit 7304445a7efa9f30e4541b075a2022319f291e4e
Author: Alexandre Julliard <julliard(a)winehq.org>
Date: Thu Sep 6 12:38:13 2012 +0200
user32: Maintain a list of active window surfaces and flush them
periodically.
:040000 040000 d6b8f4ca6d5580fd689cb2ac8f1b66f4f296fc01
704eac5fc311e63d373e399c63a2488a6b3dedca M dlls
0. Download Dr.com client(ver3.73, build3700)
http://ishare.iask.sina.com.cn/f/13638045.html
1. winetricks -q mfc42
2. install Dr.com
3. start Dr.com
~/.wine/drive_c/Program\ Files/Dr.COM宽带认证客户端$
$ wine ishare_user.exe
4. Click on menu bar, or type in any input form
Expect result:
The UI of Dr.com should be response instant
Actual result:
The UI hang for a short while when clicking on menu bar, the inputted letters
delay for a short while when typing into input form.
I'm not sure whether it is a 'real regression', will retest after Bug 32289
fixed.
--
Configure bugmail: http://bugs.winehq.org/userprefs.cgi?tab=email
Do not reply to this email, post in Bugzilla using the
above URL to reply.
------- You are receiving this mail because: -------
You are watching all bug changes.
http://bugs.winehq.org/show_bug.cgi?id=32289
Bug #: 32289
Summary: Dr.com client doesn't work
Product: Wine
Version: 1.5.18
Platform: x86-64
OS/Version: Linux
Status: UNCONFIRMED
Severity: normal
Priority: P2
Component: -unknown
AssignedTo: wine-bugs(a)winehq.org
ReportedBy: siyanmao.sec(a)gmail.com
Classification: Unclassified
Created attachment 42615
--> http://bugs.winehq.org/attachment.cgi?id=42615
Log file on wine 1.5.18
Dr.com client(ver3.73, build3700) worked well on wine-1.5.17 or previous
versions, but it doesn't work on wine-1.5.18.
0.download Dr.com client from http://ishare.iask.sina.com.cn/f/13638045.html
1.install dr.com
2.install mfc42 with with winetricks
3.start Dr.com
$ cd ~/.wine/drive_c/drcom/
$ wine ishare_user.exe
the program lose response
OS:arch Linux (Kernel:3.6.7)
--
Configure bugmail: http://bugs.winehq.org/userprefs.cgi?tab=email
Do not reply to this email, post in Bugzilla using the
above URL to reply.
------- You are receiving this mail because: -------
You are watching all bug changes.
http://bugs.winehq.org/show_bug.cgi?id=30777
Bug #: 30777
Summary: Dr.com v3.71 infinitely asks for reboot due to missing
registry entry
Product: Wine
Version: unspecified
Platform: x86
OS/Version: Linux
Status: UNCONFIRMED
Severity: normal
Priority: P2
Component: -unknown
AssignedTo: wine-bugs(a)winehq.org
ReportedBy: fracting(a)gmail.com
Classification: Unclassified
1. Download Dr.com v3.71 from:
http://wlzx.cdutetc.cn/down.do?action=downLoad&did=2c9082c818e76c2a0118ea36…
(Reference: http://forum.ubuntu.org.cn/viewtopic.php?f=156&t=366057&start=15 )
2. install Dr.com
3. install mfc42
$ winetricks -q mfc42
4. copy native npptools.dll
5. start Dr.com
$ cd ~/.wine/drive_c/Program\ Files/Dr.COM\ 宽带认证客户端
$ wine ishare_user.exe
An message box says: "Driver is installed, reboot needed"
However, after wineboot again and again, the same error still persists.
An +reg trace show some interesting things as below:
--- snip ---
trace:reg:NtOpenKey (0x24,L"Software\\Wine\\Network",2000000,0x32fc84)
trace:reg:NtOpenKey <- (nil)
trace:reg:NtOpenKey
(0x20,L"SYSTEM\\CurrentControlSet\\Services\\WinSock2\\DrcomPacketCapture",20019,0x32fb08)
trace:reg:NtOpenKey <- (nil)
trace:reg:NtOpenKey
(0x20,L"SYSTEM\\CurrentControlSet\\Services\\WinSock2\\DrcomPacketCapture",20019,0x32faf0)
trace:reg:NtOpenKey <- (nil)
trace:reg:NtOpenKey
(0x20,L"SYSTEM\\CurrentControlSet\\Services\\WinSock2\\Parameters\\Protocol_Catalog9\\Catalog_Entries",20019,0x32f9f8)
trace:reg:NtOpenKey <- (nil)
--- snip ---
After import
"SYSTEM\\CurrentControlSet\\Services\\WinSock2\\Parameters\\Protocol_Catalog9\\Catalog_Entries"
from WinXP to Wine, Dr.com complains "reboot needed" one more time then start
correctly finally.
A minimum registry file to cheat Dr.com v3.71 is as below:
--- snip ---
Windows Registry Editor Version 5.00
[HKEY_LOCAL_MACHINE\SYSTEM\CurrentControlSet\Services\WinSock2]
[HKEY_LOCAL_MACHINE\SYSTEM\CurrentControlSet\Services\WinSock2\Parameters]
[HKEY_LOCAL_MACHINE\SYSTEM\CurrentControlSet\Services\WinSock2\Parameters\Protocol_Catalog9]
[HKEY_LOCAL_MACHINE\SYSTEM\CurrentControlSet\Services\WinSock2\Parameters\Protocol_Catalog9\Catalog_Entries]
--- snip ---
--
Configure bugmail: http://bugs.winehq.org/userprefs.cgi?tab=email
Do not reply to this email, post in Bugzilla using the
above URL to reply.
------- You are receiving this mail because: -------
You are watching all bug changes.
http://bugs.winehq.org/show_bug.cgi?id=29083
Bug #: 29083
Summary: Logitech Harmony Remote Fails to install
Product: Wine
Version: 1.3.32
Platform: x86
OS/Version: Linux
Status: UNCONFIRMED
Severity: normal
Priority: P2
Component: -unknown
AssignedTo: wine-bugs(a)winehq.org
ReportedBy: cycoone(a)hotmail.com
Classification: Unclassified
Created attachment 37478
--> http://bugs.winehq.org/attachment.cgi?id=37478
Debugger output
When trying to run the Logitech Harmony Remote Software Wine immediately brings
up a crash dialog and the following in the console:
fixme:storage:create_storagefile Storage share mode not implemented.
WARNING: no socket to connect to
wine: Call from 0x7b83a192 to unimplemented function
apphelp.dll.ApphelpCheckInstallShieldPackage, aborting
wine: Unimplemented function apphelp.dll.ApphelpCheckInstallShieldPackage
called at address 0x7b83a192 (thread 0009), starting debugger...
Debugger output attached.
LogitechHarmonySoftware.exe is available at www.myharmony.com. OS detection is
used, I downloaded it with Firefox 8 in Wine. This machine is dual boot and I
was able to run the program without issue in Windows XP.
--
Configure bugmail: http://bugs.winehq.org/userprefs.cgi?tab=email
Do not reply to this email, post in Bugzilla using the
above URL to reply.
------- You are receiving this mail because: -------
You are watching all bug changes.
https://bugs.winehq.org/show_bug.cgi?id=46482
Bug ID: 46482
Summary: Gas Guzzlers Combat Carnage crashes when changing
screen resolution
Product: Wine
Version: 4.0-rc6
Hardware: x86-64
OS: Linux
Status: NEW
Severity: normal
Priority: P2
Component: directx-d3d
Assignee: wine-bugs(a)winehq.org
Reporter: andrey.goosev(a)gmail.com
Distribution: ---
Created attachment 63313
--> https://bugs.winehq.org/attachment.cgi?id=63313
backtrace
Crashes when I try to change screen resolution from 1280x720 to 1280x800
wine-4.0-rc6-41-g5e677beef5
--
Do not reply to this email, post in Bugzilla using the
above URL to reply.
You are receiving this mail because:
You are watching all bug changes.
https://bugs.winehq.org/show_bug.cgi?id=48968
Bug ID: 48968
Summary: Cossacks 2 Battle for Europe broke bottom of screen
when using ALT + TAB
Product: Wine
Version: 5.6
Hardware: x86-64
OS: Linux
Status: UNCONFIRMED
Severity: normal
Priority: P2
Component: -unknown
Assignee: wine-bugs(a)winehq.org
Reporter: mikrutrafal54(a)gmail.com
Distribution: ---
Created attachment 66944
--> https://bugs.winehq.org/attachment.cgi?id=66944
Log from running Cossacks 2
When I go to the desktop when I'm in map campaign in Cossacks 2 Battle for
Europe(gog version 1.3) then when I back the screen is broke at the bottom and
doesn't show any buttons until I go to battle.
In battle when I use ALT-TAB, then map becomes transparent.
This is shown on pictures on imgur - https://imgur.com/a/zZ8EAHW
Very rarely Cossacks crash when I use ALT-TAB and show this errors
002b:err:x11settings:X11DRV_ChangeDisplaySettingsEx No matching mode found:
width=160 height=24 bpp=16 (XRandR 1.2)
002b:err:x11settings:X11DRV_ChangeDisplaySettingsEx No matching mode found:
width=160 height=24 bpp=16 (XRandR 1.2)
This happens also on my laptop with Intel HD 3000(Mesa 19.3) but also on
computer with GTX 970(Nvidia 440)
This isn't recent bug because this happens to me also 1/2 years ago
--
Do not reply to this email, post in Bugzilla using the
above URL to reply.
You are receiving this mail because:
You are watching all bug changes.
https://bugs.winehq.org/show_bug.cgi?id=38420
Bug ID: 38420
Summary: Sticky mouse with xinput2
Product: Wine
Version: 1.7.39
Hardware: x86
OS: Linux
Status: UNCONFIRMED
Severity: normal
Priority: P2
Component: directx-dinput
Assignee: wine-bugs(a)winehq.org
Reporter: brebs(a)sent.com
Distribution: ---
Hi, the Stalker series and also Sniper Elite have been affected by this issue
for years, since the infamous Wine "mousewarp" bugs.
When wine (currently tried upto 1.7.39) is *not* compiled with the option:
--without-xinput2
Then the full-screen mouse has a strange intermittent sticky/slowdown effect,
on both horizontal and vertical axes. It seems like xinput2's pointer barriers
are taking effect - the mouse gets some invisible resistance, and has to be
"pushed through" the barrier with extra force.
This is only an issue when wine is compiled *with* xinput2.
This is especially a problem with the Stalker games (e.g. Stalker Lost Alpha),
which need the mouse to work in the menu & inventory screens, as well as
first-person view.
--
Do not reply to this email, post in Bugzilla using the
above URL to reply.
You are receiving this mail because:
You are watching all bug changes.
http://bugs.winehq.org/show_bug.cgi?id=19223
Summary: null Object reference during Database object expansion
(MS SQL SMSE)
Product: Wine
Version: 1.1.25
Platform: PC
OS/Version: Linux
Status: UNCONFIRMED
Severity: normal
Priority: P2
Component: -unknown
AssignedTo: wine-bugs(a)winehq.org
ReportedBy: m27315(a)gmail.com
Created an attachment (id=22225)
--> (http://bugs.winehq.org/attachment.cgi?id=22225)
Wine log for SSMSEE
Immediately after launching Microsoft's SQL Server Management Studio Express,
an "Object Explorer" pane is visible on the left to explore the connected SQL
server. Double-clicking on the "Databases" node to expand it produces the
following error message (see below)...
The databases can be acquired using the "Summary" window, and then the "Object
Explorer" pane can be synchronized to the "Summary" window. Although a
workaround exists, it is clumsy. Plus, a method so basic as expanding the
connected databases should not create such an error.
Incidentally, the error message is empty at first, and the message can only be
viewed by clicking on the "Show technical details" button in the error log...
===================================
Object reference not set to an instance of an object.
(Microsoft.SqlServer.Express.ObjectExplorer)
------------------------------
Program Location:
at
Microsoft.SqlServer.Management.UI.VSIntegration.ObjectExplorer.SystemObjectAccessHandler.get_HideSystemObjects()
at
Microsoft.SqlServer.Management.UI.VSIntegration.ObjectExplorer.SystemObjectAccessHandler.Visible(INodeInformation
source)
at
Microsoft.SqlServer.Management.UI.VSIntegration.ObjectExplorer.NavigableItemBuilder.IsNodeVisible(NavigableItem
item)
at
Microsoft.SqlServer.Management.UI.VSIntegration.ObjectExplorer.NavigableItemBuilder.BuildStaticItem(IList
nodes, INodeInformation source, INavigableItem sourceItem)
at
Microsoft.SqlServer.Management.UI.VSIntegration.ObjectExplorer.NavigableItemBuilder.Build(INodeInformation
source, INavigableItem sourceItem, IFilterProvider filter)
at
Microsoft.SqlServer.Management.UI.VSIntegration.ObjectExplorer.NavigableItem.GetChildren()
at
Microsoft.SqlServer.Management.UI.VSIntegration.ObjectExplorer.ExplorerHierarchyNode.BuildChildren()
--
Configure bugmail: http://bugs.winehq.org/userprefs.cgi?tab=email
Do not reply to this email, post in Bugzilla using the
above URL to reply.
------- You are receiving this mail because: -------
You are watching all bug changes.
http://bugs.winehq.org/show_bug.cgi?id=30069
Bug #: 30069
Summary: MSDE2000A fails due to NtCreatePort being a stub
Product: Wine
Version: 1.4-rc5
Platform: x86
URL: http://www.microsoft.com/download/en/details.aspx?id=2
2661
OS/Version: Linux
Status: UNCONFIRMED
Severity: normal
Priority: P2
Component: ntdll
AssignedTo: wine-bugs(a)winehq.org
ReportedBy: djelinski1(a)gmail.com
Classification: Unclassified
Created attachment 39177
--> http://bugs.winehq.org/attachment.cgi?id=39177
log of setup.exe in wine 1.4-rc5
To reproduce:
Download and run the MSDE installer MSDE2000A.EXE from
http://www.microsoft.com/download/en/details.aspx?id=22661
This will unpack to directory c:\MSDERelA.
Go to that directory, then run
setup.exe SAPWD=Hello
It will install MSSQLServer service and attempt to start it. The service will
fail to start, and the installer will subsequently (after ca.2 minutes) remove
all installed files.
I managed to reproduce it faster via interrupting the installer before it has a
chance to remove the service - after that starting any wine application
triggers the bug.
NtCreatePort is a part of undocumented Microsoft API called LPC. Some attempts
at documenting it can be found via google, e.g.:
http://www.zezula.net/en/prog/lpc.htmlhttp://blogs.msdn.com/b/ntdebugging/archive/2007/07/26/lpc-local-procedure-…
--
Configure bugmail: http://bugs.winehq.org/userprefs.cgi?tab=email
Do not reply to this email, post in Bugzilla using the
above URL to reply.
------- You are receiving this mail because: -------
You are watching all bug changes.
http://bugs.winehq.org/show_bug.cgi?id=17785
Summary: MSDE fails to register its service(i think).
Product: Wine
Version: unspecified
Platform: PC-x86-64
OS/Version: Linux
Status: UNCONFIRMED
Severity: normal
Priority: P2
Component: msi
AssignedTo: wine-bugs(a)winehq.org
ReportedBy: nicklas(a)ws.se
Created an attachment (id=20011)
--> (http://bugs.winehq.org/attachment.cgi?id=20011)
A log of an attempt to run "wine setup.exe SAPWD=XXXXX" after successfully
decompressing the installation files.
I am quite new to wine and especially it's logging style, but it seems to me
that it fails to register its service. However i might obviously be completely
wrong.
The error(s) occurs while running "wine setup.exe SAPWD=XXXXX" after
successfully decompressing the installation files into C:\InstDir\ .
I have also tried with the BLANKSAPWD=1 switch.
I have no idea of the severity of this bug, however(being a newcomer) I set i
to normal, even though I'd suspect a lot of server applications would run into
similar issues, which would constitute a "wide range" and a "major" severity.
I am also not sure of which component to assign it to.
--
Configure bugmail: http://bugs.winehq.org/userprefs.cgi?tab=email
Do not reply to this email, post in Bugzilla using the
above URL to reply.
------- You are receiving this mail because: -------
You are watching all bug changes.
http://bugs.winehq.org/show_bug.cgi?id=31594
Bug #: 31594
Summary: SolidWorks 2010: Crash at assigning material
Product: Wine
Version: 1.5.12
Platform: x86
OS/Version: Linux
Status: UNCONFIRMED
Severity: normal
Priority: P2
Component: -unknown
AssignedTo: wine-bugs(a)winehq.org
ReportedBy: lukasz.wojnilowicz(a)gmail.com
Classification: Unclassified
Created attachment 41549
--> http://bugs.winehq.org/attachment.cgi?id=41549
Terminal output on Wine 1.5.12
Steps to reproduce:
1) remove ~/.wine
2) winetricks vcrun2005 vcrun2008 mfc40 dotnet30
3) install SolidWorks 2010
4) start SolidWorks 2010
5) create new part
6) assign material to it
Behaviour:
crash without any fatal error.
Expected behaviour:
no crash.
--
Configure bugmail: http://bugs.winehq.org/userprefs.cgi?tab=email
Do not reply to this email, post in Bugzilla using the
above URL to reply.
------- You are receiving this mail because: -------
You are watching all bug changes.
http://bugs.winehq.org/show_bug.cgi?id=31591
Bug #: 31591
Summary: SolidWorks 2010: Installation of service pack 5.0
fails
Product: Wine
Version: 1.5.12
Platform: x86
OS/Version: Linux
Status: UNCONFIRMED
Severity: normal
Priority: P2
Component: msi
AssignedTo: wine-bugs(a)winehq.org
ReportedBy: lukasz.wojnilowicz(a)gmail.com
Classification: Unclassified
Created attachment 41541
--> http://bugs.winehq.org/attachment.cgi?id=41541
Terminal output on Wine 1.5.12
Steps to reproduce:
1) remove ~/.wine
2) winetricks vcrun2005 vcrun2008 mfc40 dotnet30
2) install SolidWorks 2010
3) install SP5 by 'wine start sw2010-0.0-5.0-i.msp'
Behaviour:
Installer shows up, something is going up, at the end there is silent crash or
information that installer was interrupted. I start SolidWorks 2010 and there
is no sign that SP5 is installed.
Expected behaviour:
I should see in SolidWorks 2010, that SP5 is installed.
--
Configure bugmail: http://bugs.winehq.org/userprefs.cgi?tab=email
Do not reply to this email, post in Bugzilla using the
above URL to reply.
------- You are receiving this mail because: -------
You are watching all bug changes.
http://bugs.winehq.org/show_bug.cgi?id=31486
Bug #: 31486
Summary: SolidWorks 2012: sldim crashes
Product: Wine
Version: 1.5.10
Platform: x86
OS/Version: Linux
Status: UNCONFIRMED
Severity: normal
Priority: P2
Component: -unknown
AssignedTo: wine-bugs(a)winehq.org
ReportedBy: lukasz.wojnilowicz(a)gmail.com
Classification: Unclassified
Created attachment 41392
--> http://bugs.winehq.org/attachment.cgi?id=41392
Terminal output on wine-1.5.10-250-g6c1fcaa
Steps to reproduce:
1) remove ~/.wine
2) wine setup.exe
Behaviour:
Wine crash.
Expected behaviour:
No Wine crash.
--
Configure bugmail: http://bugs.winehq.org/userprefs.cgi?tab=email
Do not reply to this email, post in Bugzilla using the
above URL to reply.
------- You are receiving this mail because: -------
You are watching all bug changes.
http://bugs.winehq.org/show_bug.cgi?id=16592
Summary: Ford service manual viewer fails to detect CD (fix
attached)
Product: Wine
Version: unspecified
Platform: PC
OS/Version: FreeBSD
Status: UNCONFIRMED
Severity: normal
Priority: P2
Component: kernel32
AssignedTo: wine-bugs(a)winehq.org
ReportedBy: p-wine-bugs(a)ziemba.us
Created an attachment (id=18120)
--> (http://bugs.winehq.org/attachment.cgi?id=18120)
patch to handle null-rootpath equivalent in GetVolumeInformationW
wine-1.1.10
I installed the Ford 1993-1994 truck service manual viewer from CD. The viewer
application requires that the CD be present in a drive before it will show
service data.
The viewer application c:/FORD/PUBS/programs/VIEW16.EXE complains that there is
no CD present, even though there is. (yes, links for d: and d:: were made
correctly in .wine/dosdevices).
It turns out that the application calls GetVolumeInformationW with a "root"
argument of "\\:". In this case, GetCurrentDirectoryW returns the desired root
path, but since root is not null, the code in GetVolumeInformationW uses "\\"
as the drive letter instead (and fails).
Patching GetVolumeInformationW to treat root == "\\:" the same as the null case
results in the application successfully detecting the CD and operating
properly.
Documentation of GetVolumeInformationW on MSDN seems to indicate that there is
a broader range of possible formats for the root parameter than the wine
implementation currently handles, so perhaps a more extensive fix is needed for
the general case.
--
Configure bugmail: http://bugs.winehq.org/userprefs.cgi?tab=email
Do not reply to this email, post in Bugzilla using the
above URL to reply.
------- You are receiving this mail because: -------
You are watching all bug changes.
http://bugs.winehq.org/show_bug.cgi?id=16567
Summary: moving mouse outside the wine virtual desktop causes
crash in FastBltNoTrans()
Product: Wine
Version: 1.0.1
Platform: PC
OS/Version: Windows XP
Status: UNCONFIRMED
Severity: enhancement
Priority: P2
Component: -unknown
AssignedTo: wine-bugs(a)winehq.org
ReportedBy: stephanecharette(a)gmail.com
Installed the game "Nancy Drew: Stay Tuned For Danger". Installation and game
start seems to work well. But the mouse icon is customized for the game, and
changes depending on whether there is an object under the mouse with which you
can interact.
If at any point during the game the mouse is moved outside the wine virtual
dekstop, the game immediately crashes with the following Windows dialog window:
-----------------------
FastBltNoTrans() - err ret = 88760096, pDescription = Dirty Rect Fast Blt,
rSrcRect: t=158, b=198, l=-5, r=25, dwDestX=-5, dwDestY=158 - DDERR_INVALIDRECT
- Rectangle provided was invalid.
-----------------------
I added it to AppDB here:
http://appdb.winehq.org/objectManager.php?sClass=version&iId=14880
I also have an earlier forum posting here with several other details:
http://forum.winehq.org/viewtopic.php?t=3190
--
Configure bugmail: http://bugs.winehq.org/userprefs.cgi?tab=email
Do not reply to this email, post in Bugzilla using the
above URL to reply.
------- You are receiving this mail because: -------
You are watching all bug changes.
https://bugs.winehq.org/show_bug.cgi?id=48267
Bug ID: 48267
Summary: Heavy Rain Demo has buggy animations
Product: Wine
Version: 4.21
Hardware: x86
OS: Linux
Status: UNCONFIRMED
Severity: normal
Priority: P2
Component: xaudio2
Assignee: wine-bugs(a)winehq.org
Reporter: sashok.olen(a)gmail.com
Distribution: ---
Heavy Rain Demo (free and available through EGS, which can be easily installer
through Lutris) seems to have a problem with its animations when using Wine's
implementation of xaudio2_7.
Particularly, they don't seem to finish and instead just repeat in a loop. You
can see it in this video: https://www.youtube.com/watch?v=R-cWHZnx4xM (there
also seem to be some awful cracking going on but it seems to only affect the
full game so ¯\_(ツ)_/¯ )
Using native xaudio2_7.dll solves the animation issues.
When using wine's implementation of xaudio2, the only xaudio-related line in
the logs appear to be this:
0152:fixme:xaudio2:IXAudio2Impl_QueryInterface
(0xa5ba90)->({60d8dac8-5aa1-4e8e-b597-2f5e2883d484},0x22f950), not found
As a backend, I use FAudio.
Let me know if any logs are needed and which debug channels I need to use.
--
Do not reply to this email, post in Bugzilla using the
above URL to reply.
You are receiving this mail because:
You are watching all bug changes.
https://bugs.winehq.org/show_bug.cgi?id=46454
Bug ID: 46454
Summary: Minimalistic C++ program removing non-empty directory
is not working
Product: Wine
Version: 4.0-rc5
Hardware: x86-64
OS: Linux
Status: UNCONFIRMED
Severity: normal
Priority: P2
Component: -unknown
Assignee: wine-bugs(a)winehq.org
Reporter: contact(a)shaac.me
Distribution: ---
Created attachment 63241
--> https://bugs.winehq.org/attachment.cgi?id=63241
The binary that works well on Windows, and less well with Wine
If Wine executes a C++ program executing `std::filesystem::remove_all`,
compiled with MSVC, then it will only succeed to remove empty folders, but will
silently fail if the folder is not empty. The call will not raise any error,
but the folder and its content will stay on disk.
In attachment is such a program, rm.exe. If you do `rm.exe <dirname>` on wine,
it will fail to delete non-empty folders. But the same command on Windows will
succeed.
The only Wine terminal output, which shows both when deleting an empty folder
(success) and a non empty-one (failure: bug), is:
002b:fixme:kernelbase:AppPolicyGetProcessTerminationMethod 0xfffffffffffffffa,
0x22fd10
I tested this with wine-4.0-rc5 on Archlinux. And did the Windows side of tests
on a Windows 7 professional.
The program source code is:
#include <filesystem>
int main(int, char** argv)
{
std::filesystem::remove_all(std::filesystem::path(argv[1]));
}
I compiled this program with MSVC version 19.15.26732.1 for x64, with Wine, and
with `/EHsc /TP /std:c++17` flags.
--
Do not reply to this email, post in Bugzilla using the
above URL to reply.
You are receiving this mail because:
You are watching all bug changes.
https://bugs.winehq.org/show_bug.cgi?id=47961
Bug ID: 47961
Summary: Chernobylite: crashes on startup with "Fatal error!"
Product: Wine
Version: 4.17
Hardware: x86-64
OS: Linux
Status: UNCONFIRMED
Severity: normal
Priority: P2
Component: mfplat
Assignee: wine-bugs(a)winehq.org
Reporter: joseph.kogut(a)gmail.com
Distribution: ---
Created attachment 65468
--> https://bugs.winehq.org/attachment.cgi?id=65468
Debug log w/ +mfplat
Game crashes on startup, displaying a dialog box with the message "Fatal
error!"
This seems to be another UE4 game that requires Windows Media Foundation APIs
for media playback. Installing native versions of these libraries allows the
game to start; singleplayer doesn't work even with workarounds.
--
Do not reply to this email, post in Bugzilla using the
above URL to reply.
You are receiving this mail because:
You are watching all bug changes.
https://bugs.winehq.org/show_bug.cgi?id=43705
Bug ID: 43705
Summary: PES 2018 Settings.exe crashes
Product: Wine
Version: 2.16
Hardware: x86-64
OS: Linux
Status: UNCONFIRMED
Severity: normal
Priority: P2
Component: -unknown
Assignee: wine-bugs(a)winehq.org
Reporter: plata(a)mailbox.org
Distribution: ---
Created attachment 59172
--> https://bugs.winehq.org/attachment.cgi?id=59172
Invalid IL code
When Pro Evolution Soccer (PES) 2018 is installed, Settings.exe is executed.
It crashes with the exception in the attachment.
--
Do not reply to this email, post in Bugzilla using the
above URL to reply.
You are receiving this mail because:
You are watching all bug changes.
http://bugs.winehq.org/show_bug.cgi?id=34541
Bug #: 34541
Summary: Max Payne 3 needs native dotnet20
Product: Wine
Version: 1.7.2
Platform: x86
OS/Version: Linux
Status: UNCONFIRMED
Severity: normal
Priority: P2
Component: mscoree
AssignedTo: wine-bugs(a)winehq.org
ReportedBy: andrey.goosev(a)gmail.com
Classification: Unclassified
Created attachment 45984
--> http://bugs.winehq.org/attachment.cgi?id=45984
log
As titled.
--
Configure bugmail: http://bugs.winehq.org/userprefs.cgi?tab=email
Do not reply to this email, post in Bugzilla using the
above URL to reply.
------- You are receiving this mail because: -------
You are watching all bug changes.
http://bugs.winehq.org/show_bug.cgi?id=23537
Summary: Notepad in Hebrew shows some squares instead of
characters
Product: Wine
Version: 1.2-rc6
Platform: x86-64
OS/Version: Linux
Status: UNCONFIRMED
Severity: normal
Priority: P2
Component: -unknown
AssignedTo: wine-bugs(a)winehq.org
ReportedBy: Paul.Vriens.Wine(a)gmail.com
Created an attachment (id=29391)
--> (http://bugs.winehq.org/attachment.cgi?id=29391)
Screenshot showing the squares
We now have a Hebrew translation of notepad. The goal was to have at least one
translation in so we can see what bugs we currently have with respect to Hebrew
(and Arabic for that matter).
The screenshot shows some squares where it should show Hebrew text.
I have no idea where to look yet. The title bar seems fine but the text in the
dialog isn't.
Some of the other dialogs also shows squares but I guess it boils down to the
same bug.
--
Configure bugmail: http://bugs.winehq.org/userprefs.cgi?tab=email
Do not reply to this email, post in Bugzilla using the
above URL to reply.
------- You are receiving this mail because: -------
You are watching all bug changes.
https://bugs.winehq.org/show_bug.cgi?id=48981
Bug ID: 48981
Summary: Riot Vanguard (Riot Games) needs Microsoft Kernel Mode
Cryptographic Primitives Library 'cng.sys'
Product: Wine
Version: 5.6
Hardware: x86-64
OS: Linux
Status: NEW
Severity: normal
Priority: P2
Component: -unknown
Assignee: wine-bugs(a)winehq.org
Reporter: focht(a)gmx.net
Distribution: ---
Hello folks,
as it says. There are some fixes required prior to come to this place. I'll
create/reference more bug reports later for them.
There is a public document which describes the module and the API:
https://csrc.nist.gov/csrc/media/projects/cryptographic-module-validation-p…
--- quote ---
Microsoft Windows7 Kernel Mode Cryptographic Primitives Library (cng.sys)
Microsoft Windows 7 Operating System
FIPS 140-2 Security Policy Document
This document specifies the security policy for the Microsoft Kernel Mode
Cryptographic Primitives Library (CNG.SYS) as described in FIPS PUB 140-2.
January 16, 2013
Document Version: 2.2
--- quote ---
--- snip ---
...
The vgk service is starting.
002d:trace:loaddll:load_native_dll Loaded
L"C:\\windows\\system32\\kernelbase.dll" at 0x7b000000: PE builtin
002d:trace:loaddll:load_so_dll Loaded L"C:\\windows\\system32\\kernel32.dll" at
0x7b410000: builtin
002d:trace:loaddll:load_native_dll Loaded
L"C:\\windows\\system32\\winedevice.exe" at 0x140000000: PE builtin
002d:trace:loaddll:load_so_dll Loaded L"C:\\windows\\system32\\advapi32.dll" at
0x7f39a2c80000: builtin
002d:trace:loaddll:load_so_dll Loaded L"C:\\windows\\system32\\msvcrt.dll" at
0x7f39a2aa0000: builtin
002d:trace:loaddll:load_native_dll Loaded
L"C:\\windows\\system32\\ntoskrnl.exe" at 0x180000000: PE builtin
002d:trace:loaddll:load_so_dll Loaded L"C:\\windows\\system32\\ucrtbase.dll" at
0x7f39a2970000: builtin
002d:trace:loaddll:load_native_dll Loaded L"C:\\windows\\system32\\rpcrt4.dll"
at 0x9b0000: PE builtin
002f:trace:ntoskrnl:ZwLoadDriver
(L"\\Registry\\Machine\\System\\CurrentControlSet\\Services\\vgk")
002f:trace:ntoskrnl:open_driver opened service for driver
L"\\Registry\\Machine\\System\\CurrentControlSet\\Services\\vgk"
002f:trace:ntoskrnl:IoCreateDriver (L"\\Driver\\vgk", 00000001800132F0)
002f:trace:ntoskrnl:load_driver loading driver L"C:\\Program Files\\Riot
Vanguard\\vgk.sys"
002f:err:module:import_dll Library cng.sys (which is needed by L"C:\\Program
Files\\Riot Vanguard\\vgk.sys") not found
002f:trace:ntoskrnl:IoDeleteDriver (0000000000723070)
002f:trace:ntoskrnl:ObDereferenceObject (0000000000723070) ref=0
002f:err:ntoskrnl:ZwLoadDriver failed to create driver
L"\\Registry\\Machine\\System\\CurrentControlSet\\Services\\vgk": c0000142
DLL initialization failed.
--- snip ---
Only two 'cng.sys' functions are currently imported:
--- snip ---
$ winedump -j import vgk.sys
Contents of vgk.sys: 3196560 bytes
Import Table size: 00000050
offset 0001e090 cng.sys
Hint/Name Table: 00022108
TimeDateStamp: 00000000 (Thu Jan 1 01:00:00 1970)
ForwarderChain: 00000000
First thunk RVA: 0001B028
Thunk Ordn Name
0001b028 8 BCryptDestroyHash
0001b030 1 BCryptCloseAlgorithmProvider
...
Done dumping vgk.sys
--- snip ---
$ wine --version
wine-5.6-258-gf31a29b8d1
Regards
--
Do not reply to this email, post in Bugzilla using the
above URL to reply.
You are receiving this mail because:
You are watching all bug changes.
https://bugs.winehq.org/show_bug.cgi?id=46472
Bug ID: 46472
Summary: Linux kernel 4.19 breaks startup of BO2 due to change
in PTRACE_POKEUSER hw breakpoint behavior
Product: Wine
Version: 4.0-rc6
Hardware: x86-64
OS: Linux
Status: UNCONFIRMED
Severity: major
Priority: P2
Component: -unknown
Assignee: wine-bugs(a)winehq.org
Reporter: troyb(a)us.ibm.com
Distribution: ---
Created attachment 63297
--> https://bugs.winehq.org/attachment.cgi?id=63297
linux 4.19 commit bd14406b78e6daa1ea3c1673bda1ffc9efdeead0
I bisected Linux 4.18 to 4.19 to find this commit which stops BO2 from
launching under any version of wine from 3.12 to 4.0-rc6, attachment below.
For convenience I hand-reverted the file kernel/events/hw_breakpoint.c as
follows :
/**
* modify_user_hw_breakpoint - modify a user-space hardware breakpoint
* @bp: the breakpoint structure to modify
* @attr: new breakpoint attributes
*/
int modify_user_hw_breakpoint(struct perf_event *bp, struct perf_event_attr
*attr)
{
int err;
/*
* modify_user_hw_breakpoint can be invoked with IRQs disabled and
hence it
* will not be possible to raise IPIs that invoke __perf_event_disable.
* So call the function directly after making sure we are targeting the
* current task.
*/
if (irqs_disabled() && bp->ctx && bp->ctx->task == current)
perf_event_disable_local(bp);
else
perf_event_disable(bp);
#if 0
/* new logic : >= kernel 4.19 */
err = modify_user_hw_breakpoint_check(bp, attr, false);
if (!bp->attr.disabled)
perf_event_enable(bp);
return err;
#else
/* old logic : <kernel 4.19 */
if (!attr->disabled) {
err = modify_user_hw_breakpoint_check(bp, attr, false);
if (err)
return err;
perf_event_enable(bp);
bp->attr.disabled=0;
}
return 0;
#endif
}
I examined some wine source code and found many instance of use of
PTRACE_POKUSER. I don't know enough about this function to know if this kernel
commit directly breaks the wine code, or some other fault in wine code is
indirectly triggering the problem. Using "old logic" in the file
hw_breakpoints above enables kernel 4.19 to start BO2 with 4.0-rc6 (and most
likely others).
--
Do not reply to this email, post in Bugzilla using the
above URL to reply.
You are receiving this mail because:
You are watching all bug changes.
https://bugs.winehq.org/show_bug.cgi?id=50088
Bug ID: 50088
Summary: Memento Mori needs WMReaderAdvanced2_OpenStream
Product: Wine
Version: 5.20
Hardware: x86-64
OS: Linux
Status: NEW
Severity: minor
Priority: P2
Component: wmp&wmvcore
Assignee: wine-bugs(a)winehq.org
Reporter: andrey.goosev(a)gmail.com
Distribution: ---
Error: "Cannot initialize windows media video playback."
fixme:wmvcore:WMReaderAdvanced2_OpenStream (0855A508)->(0844E1A0 0844E668
0844E668)
Works after installing WMP10.
wine-5.20-141-g03eaa2cc93e
--
Do not reply to this email, post in Bugzilla using the
above URL to reply.
You are receiving this mail because:
You are watching all bug changes.
https://bugs.winehq.org/show_bug.cgi?id=48791
Bug ID: 48791
Summary: Multiple games have sound stuttering when using FAudio
(Sniper Elite series, Resident Evil 0 HD Remaster,
Homesick)
Product: Wine
Version: 5.4
Hardware: x86-64
OS: Linux
Status: NEW
Severity: minor
Priority: P2
Component: xaudio2
Assignee: wine-bugs(a)winehq.org
Reporter: andrey.goosev(a)gmail.com
Distribution: ---
For Sniper Elite V2 and 3 after starting a new game sound in an intro gets
stuttering after a while.
Resident Evil has stuttering during dialogs only. (starts after
d98fda29bbd60053885a63706e268edb8fe536ed)
--
Do not reply to this email, post in Bugzilla using the
above URL to reply.
You are receiving this mail because:
You are watching all bug changes.
https://bugs.winehq.org/show_bug.cgi?id=46801
Bug ID: 46801
Summary: Hitman: Sniper Challenge crashes on startup when using
FAudio
Product: Wine
Version: 4.3
Hardware: x86-64
OS: Linux
Status: NEW
Severity: normal
Priority: P2
Component: xaudio2
Assignee: wine-bugs(a)winehq.org
Reporter: andrey.goosev(a)gmail.com
Distribution: ---
Created attachment 63822
--> https://bugs.winehq.org/attachment.cgi?id=63822
backtrace
mmap() failed: Cannot allocate memory
Failed to create permanent mapping for memfd region with ID = 2770054660
Ignoring received block reference with non-registered memfd ID = 2770054660
wine-4.3-188-gab7756619c
--
Do not reply to this email, post in Bugzilla using the
above URL to reply.
You are receiving this mail because:
You are watching all bug changes.
https://bugs.winehq.org/show_bug.cgi?id=46000
Bug ID: 46000
Summary: Crash in _FindAndUnlinkFrame+0x72() in ucrtbase
(0x0033f128) with SuperTux 0.6.0 nightly build
Product: Wine
Version: 3.18
Hardware: x86-64
OS: Mac OS X
Status: UNCONFIRMED
Severity: normal
Priority: P2
Component: ucrtbase
Assignee: wine-bugs(a)winehq.org
Reporter: tobbi.bugs(a)googlemail.com
Created attachment 62568
--> https://bugs.winehq.org/attachment.cgi?id=62568
backtrace
When trying to start a SuperTux Nightly build using wine 3.18, it crashes
immediately at launch.
$ openssl sha256 SuperTux-v0.5.1-1071-g1778d0aa6-win32.msi
SHA256(SuperTux-v0.5.1-1071-g1778d0aa6-win32.msi)=
b1619d9b964ec6fa858e0310f62728b978a3bf5b00cdc1689398b5c8ae3188a8
$ wine --version
wine-3.18
Download:
https://ci.appveyor.com/project/supertux/supertux-9ml4d/builds/19503980/art…
Alternative Download:
http://tobbi.bplaced.net/krams/SuperTux-v0.5.1-1071-g1778d0aa6-win32.msi
--
Do not reply to this email, post in Bugzilla using the
above URL to reply.
You are receiving this mail because:
You are watching all bug changes.
https://bugs.winehq.org/show_bug.cgi?id=43546
Bug ID: 43546
Summary: Image manipulation in astrotoaster causes repeatable
crash
Product: Wine
Version: 2.13
Hardware: x86-64
OS: Linux
Status: UNCONFIRMED
Severity: normal
Priority: P2
Component: -unknown
Assignee: wine-bugs(a)winehq.org
Reporter: jh.xsnrg(a)gmail.com
Distribution: ---
Created attachment 58949
--> https://bugs.winehq.org/attachment.cgi?id=58949
astrotoaster crash backtrace
Astrotoaster runs with default settings, but trying to manipulate and convert
images, the attached backtrace is created every time.
Works fine in native windows and windows VMs.
To reproduce, download (free) astrotoaster application:
http://www.astrotoaster.com/download/SetupAstroToaster_205a.msi?attredirect…
put a couple fits files in a folder from a set for image stacking, and
configure the image directory in the application to point to the folder with
the fits files in it.
Click on the buttons labeled "monitor", "refresh" and "stack"
A viewer window will pop up with a dark image that needs adjusting. Click the
color adj button and move the "expand" slider to any value, then click the
"apply E/G" button to reproduce the crash. It may have already crashed before
this.
convert.exe is the module with the crash.
--
Do not reply to this email, post in Bugzilla using the
above URL to reply.
You are receiving this mail because:
You are watching all bug changes.
https://bugs.winehq.org/show_bug.cgi?id=44055
Bug ID: 44055
Summary: Affinity Designer Crashing on launch
Product: Wine-staging
Version: 2.20
Hardware: x86-64
OS: Linux
Status: UNCONFIRMED
Severity: normal
Priority: P2
Component: -unknown
Assignee: wine-bugs(a)winehq.org
Reporter: buliinwhite(a)gmail.com
CC: erich.e.hoover(a)wine-staging.com, michael(a)fds-team.de,
sebastian(a)fds-team.de
Distribution: ---
Created attachment 59755
--> https://bugs.winehq.org/attachment.cgi?id=59755
Crash Report
After Successful Installation of affinity-designer-1.6.1.93.exe see bugreport:
https://bugs.winehq.org/show_bug.cgi?id=44048
i try to launch Designer.exe but its Crash.
--
Do not reply to this email, post in Bugzilla using the
above URL to reply.
You are receiving this mail because:
You are watching all bug changes.
https://bugs.winehq.org/show_bug.cgi?id=48377
Bug ID: 48377
Summary: Home Designer Suite 21.3.1.1x64 hangs on mouse button
release when drawing wall
Product: Wine
Version: 5.0-rc3
Hardware: x86-64
OS: Linux
Status: UNCONFIRMED
Severity: normal
Priority: P2
Component: -unknown
Assignee: wine-bugs(a)winehq.org
Reporter: 74.schutt(a)gmail.com
Distribution: ---
Created attachment 66130
--> https://bugs.winehq.org/attachment.cgi?id=66130
Wine terminal output
I'm testing Home Designer Suite 21.3.1.1x64 on 5.3-rc3 with the patch from bug
48371 applied.
After starting home designer and opening a new plan, I am trying to draw my
first wall.
Left mouse button down sets the starting location of the wall, and as I move
the mouse the display is continuously updated with the new wall length. When I
release the left mouse button to set the end location, the wine window stops
being updated, the mouse cursor disappears while the mouse position is inside
the wine window, and my system is otherwise idle. I have to ctrl-C in the
terminal window where I started wine to kill it.
I've attached the terminal output from Wine. At the end of the output I added
some text that appeared after I used ctrl-C to kill wine.
I'll also attach the output that Home Designer logged as it ran.
--
Do not reply to this email, post in Bugzilla using the
above URL to reply.
You are receiving this mail because:
You are watching all bug changes.
https://bugs.winehq.org/show_bug.cgi?id=40667
Bug ID: 40667
Summary: Cossacks - European Wars: Intro videos cropped and not
full screen
Product: Wine
Version: 1.9.10
Hardware: x86-64
OS: Linux
Status: UNCONFIRMED
Severity: normal
Priority: P2
Component: -unknown
Assignee: wine-bugs(a)winehq.org
Reporter: winehq(a)iooioio.orion.uberspace.de
Distribution: Other
Created attachment 54537
--> https://bugs.winehq.org/attachment.cgi?id=54537
Screenshot
When I launch the GOG version of Cossacks - European Wars, the intro videos
begin to play but they are cropped to a small square in the corner of the
screen.
I am attaching a screenshot that should be much more helpful than my
description.
--
Some additional info about my system (just in case):
Distro: Linux Mint 17.3 (64 bit)
Kernel: 4.4.0-21-generic
Graphics: Proprietary NVIDIA 364.19
--
Do not reply to this email, post in Bugzilla using the
above URL to reply.
You are receiving this mail because:
You are watching all bug changes.
https://bugs.winehq.org/show_bug.cgi?id=42476
Bug ID: 42476
Summary: COSSACKS 3 TOSWFragmentShaderHandle ERRORS PREVENT
GAME FORM STARTING WITH MESA AND AMD GPU
Product: Wine
Version: 2.0
Hardware: x86-64
OS: Linux
Status: UNCONFIRMED
Severity: critical
Priority: P2
Component: directx-d3dx9
Assignee: wine-bugs(a)winehq.org
Reporter: eutychios23(a)gmail.com
Distribution: ---
i installed all directx9 dlls and none while trying to solve the issue but
still nothing.
Wine_errorlog:
everything else.all i get is a black screen with the game cursor,but i am able
to click the menu options and the following errors no matter what i try:
TOSWFragmentShaderHandle: 0:34(11): error: could not implicitly convert
operands to arithmetic operator
TOSWFragmentShaderHandle: 0:21(11): error: could not implicitly convert
operands to arithmetic operator
TOSWFragmentShaderHandle: 0:44(11): error: could not implicitly convert
operands to arithmetic operator
TOSWFragmentShaderHandle: 0:32(11): error: could not implicitly convert
operands to arithmetic operator
TOSWFragmentShaderHandle: 0:34(11): error: could not implicitly convert
operands to arithmetic operator
TOSWFragmentShaderHandle: 0:36(11): error: could not implicitly convert
operands to arithmetic operator
TOSWFragmentShaderHandle: 0:21(11): error: could not implicitly convert
operands to arithmetic operator
TOSWFragmentShaderHandle: 0:23(11): error: could not implicitly convert
operands to arithmetic operator
TOSWFragmentShaderHandle: 0:28(22): error: could not implicitly convert
operands to arithmetic operator
0:28(18): error: cannot construct `int' from a non-numeric data type
0:28(18): error: operands to arithmetic operators must be numeric
0:28(18): error: operands to arithmetic operators must be numeric
TOSWFragmentShaderHandle: 0:43(22): error: could not implicitly convert
operands to arithmetic operator
0:43(18): error: cannot construct `int' from a non-numeric data type
0:43(18): error: operands to arithmetic operators must be numeric
0:43(18): error: operands to arithmetic operators must be numeric
TOSWFragmentShaderHandle: 0:34(11): error: could not implicitly convert
operands to arithmetic operator
TOSWFragmentShaderHandle: 0:20(11): error: could not implicitly convert
operands to arithmetic operator
Access violation at address 00880272 in module 'cossacks.exe'. Read of addres
00000058.
Access violation at address 0088037A in module 'cossacks.exe'. Read of addres
00000054.
--
Do not reply to this email, post in Bugzilla using the
above URL to reply.
You are receiving this mail because:
You are watching all bug changes.
http://bugs.winehq.org/show_bug.cgi?id=10922
Summary: JDK 6 offline installer fails to create
jdk1.6.0_03\jre\bin\msvcr71.dll, puts up error dialog
Product: Wine
Version: CVS/GIT
Platform: Other
URL: http://java.sun.com
OS/Version: other
Status: NEW
Keywords: download, Installer
Severity: enhancement
Priority: P2
Component: wine-msi
AssignedTo: wine-bugs(a)winehq.org
ReportedBy: dank(a)kegel.com
The JDK 6 offline installer, jdk-6u3-windows-i586-p.exe,
puts up an error dialog
"Error loading: C:\\Program
Files\\Java\\jdk1.6.0_03\\jre\\bin\\client\\jvm.dll"
+file,+msi shows
trace:file:CreateFileW L"c:\\Program
Files\\Java\\jdk1.6.0_03\\jre\\bin\\msvcr71.dll" GENERIC_WRITE FILE_SHARE_READ
FILE_SHARE_WRITE creation 1 attributes 0x20
...
warn:file:CreateFileW Unable to create file L"c:\\Program
Files\\Java\\jdk1.6.0_03\\jre\\bin\\msvcr71.dll" (status c000003a)
...
err:msi:ITERATE_DuplicateFiles Failed to copy file L"c:\\Program Files\\Common
Files\\Java\\Update\\Base
Images\\jdk1.6.0.b105\\patch-jdk1.6.0_03.b05\\msvcr71.dll" -> L"c:\\Program
Files\\Java\\jdk1.6.0_03\\jre\\bin\\", last error 3
...
trace:file:CreateDirectoryW L"jre/bin"
...
trace:msi:HANDLE_CustomType34 executing exe L"c:\\Program
Files\\Java\\jdk1.6.0_03\\\\jre\\bin\\javaw.exe -Xshare:dump"
...
err:module:import_dll Library MSVCR71.dll (which is needed by L"C:\\Program
Files\\Java\\jdk1.6.0_03\\jre\\bin\\client\\jvm.dll") not found
Seems like that CreateDirectory should have come before it tried
to put a file in that directory?
--
Configure bugmail: http://bugs.winehq.org/userprefs.cgi?tab=email
------- You are receiving this mail because: -------
You are watching all bug changes.
http://bugs.winehq.org/show_bug.cgi?id=35372
Bug ID: 35372
Summary: gdiplus:iTunes cannot draw text.
Product: Wine
Version: 1.7.10
Hardware: x86
OS: Linux
Status: UNCONFIRMED
Severity: normal
Priority: P2
Component: gdiplus
Assignee: wine-bugs(a)winehq.org
Reporter: matyapiro31(a)gmail.com
Classification: Unclassified
By using naitive one,iTunes shows text correctly.
But it does not say any error or fixme messages.
--
Do not reply to this email, post in Bugzilla using the
above URL to reply.
You are receiving this mail because:
You are watching all bug changes.
http://bugs.winehq.org/show_bug.cgi?id=27675
Summary: iTunes 10.3.1 can't play tutorial videos
Product: Wine
Version: 1.3.23
Platform: x86
OS/Version: Linux
Status: NEW
Severity: normal
Priority: P2
Component: -unknown
AssignedTo: wine-bugs(a)winehq.org
ReportedBy: dank(a)kegel.com
iTunes 10.3.1, installed in a clean wineprefix, crashes with a null pointer
read when you do
Help / iTunes Tutorials and click Play.
There's no really useful backtrace.
Setting win7 mode keeps it from crashing, and
it then puts up a generic-looking player with
fast forward, play, a position indicator, etc.,
but nothing happens when you press play. (Pressing
fast-forward puts up a 2x indicator, so the gui isn't dead,
it's the innards that are busted.)
--
Configure bugmail: http://bugs.winehq.org/userprefs.cgi?tab=email
Do not reply to this email, post in Bugzilla using the
above URL to reply.
------- You are receiving this mail because: -------
You are watching all bug changes.
http://bugs.winehq.org/show_bug.cgi?id=26948
Summary: iTunes 10.2.2.12: Do not open
Product: Wine
Version: unspecified
Platform: x86
OS/Version: Linux
Status: UNCONFIRMED
Severity: normal
Priority: P2
Component: -unknown
AssignedTo: wine-bugs(a)winehq.org
ReportedBy: ska_tropro(a)hotmail.com
When attempting to open the "iTunes" I get the following message:
"Apple Application Support was not found.
Apple Application Support is required to run iTunes. Please uninstall iTunes,
then install iTunes again.
Error 2 (Windows error 2)"
I've tried to uninstall, but does not occur, instead of that (probably)
reinstall the program. Even so, you still receive this message every time I try
to open the program.
I have Ubuntu 10.10, Wine 1.3.18 and the latest version of iTunes (v
10.2.2.12).
--
Configure bugmail: http://bugs.winehq.org/userprefs.cgi?tab=email
Do not reply to this email, post in Bugzilla using the
above URL to reply.
------- You are receiving this mail because: -------
You are watching all bug changes.
http://bugs.winehq.org/show_bug.cgi?id=26927
Summary: iTunes store fail.
Product: WineHQ Bugzilla
Version: unspecified
Platform: x86
OS/Version: Linux
Status: UNCONFIRMED
Severity: normal
Priority: P2
Component: bugzilla-unknown
AssignedTo: wine-bugs(a)winehq.org
ReportedBy: soulmalia(a)msn.com
The homepage of the iTunes Store goes black, making it impossible a normal
navigation in the apps, movies and books.
--
Configure bugmail: http://bugs.winehq.org/userprefs.cgi?tab=email
Do not reply to this email, post in Bugzilla using the
above URL to reply.
------- You are receiving this mail because: -------
You are watching all bug changes.
http://bugs.winehq.org/show_bug.cgi?id=19652
Summary: iTunes becomes unresponsive while navigating music
store
Product: Wine
Version: 1.1.27
Platform: PC
OS/Version: Linux
Status: UNCONFIRMED
Severity: normal
Priority: P2
Component: -unknown
AssignedTo: wine-bugs(a)winehq.org
ReportedBy: pieter.ideler(a)gmail.com
When you navigate to albums and pages on the iTunes Music Store in iTunes,
iTunes becomes unresponsive from time to time. (it is grayed out in Ubuntu)
Later on it becomes responsive again. This happens between almost every page
you navigate to.
--
Configure bugmail: http://bugs.winehq.org/userprefs.cgi?tab=email
Do not reply to this email, post in Bugzilla using the
above URL to reply.
------- You are receiving this mail because: -------
You are watching all bug changes.
https://bugs.winehq.org/show_bug.cgi?id=50019
Bug ID: 50019
Summary: BlueSkyPlan Installation ok, program crash every time
Product: Wine
Version: 5.0
Hardware: x86-64
OS: Linux
Status: UNCONFIRMED
Severity: normal
Priority: P2
Component: -unknown
Assignee: wine-bugs(a)winehq.org
Reporter: afdent64(a)gmail.com
Distribution: ---
Created attachment 68446
--> https://bugs.winehq.org/attachment.cgi?id=68446
Crash report
Every time starting program, crashing is sure
--
Do not reply to this email, post in Bugzilla using the
above URL to reply.
You are receiving this mail because:
You are watching all bug changes.
https://bugs.winehq.org/show_bug.cgi?id=47738
Bug ID: 47738
Summary: The application is SimIon, when I upload gem file or
upload iob file, it crashes.
Product: Wine
Version: unspecified
Hardware: x86
OS: Linux
Status: UNCONFIRMED
Severity: normal
Priority: P2
Component: -unknown
Assignee: wine-bugs(a)winehq.org
Reporter: yuxz2015(a)gmail.com
Distribution: ---
Created attachment 65219
--> https://bugs.winehq.org/attachment.cgi?id=65219
it is generated by SimIon when I upload the iob file of SimIon
SimIon is a software simulating the particle trajectories. 'gem' file is used
to construct the model of a simulation. 'iob' file is kind of like a zip file
including all the information of a simulation
--
Do not reply to this email, post in Bugzilla using the
above URL to reply.
You are receiving this mail because:
You are watching all bug changes.
https://bugs.winehq.org/show_bug.cgi?id=46833
Bug ID: 46833
Summary: Install of iTunes 12.9.3.3 fails
Product: Wine
Version: 4.3
Hardware: x86-64
OS: Linux
Status: UNCONFIRMED
Severity: normal
Priority: P2
Component: -unknown
Assignee: wine-bugs(a)winehq.org
Reporter: k8auf1947(a)cometchaser.de
Distribution: ---
Created attachment 63866
--> https://bugs.winehq.org/attachment.cgi?id=63866
First screenstho
Wine is configured as Windows 7.
Autorun is set to "No" during installation.
I will provide more screenshots.
--
Do not reply to this email, post in Bugzilla using the
above URL to reply.
You are receiving this mail because:
You are watching all bug changes.
https://bugs.winehq.org/show_bug.cgi?id=46719
Bug ID: 46719
Summary: iTunes crashes during the installation
Product: Wine-staging
Version: 4.2
Hardware: x86
OS: Linux
Status: UNCONFIRMED
Severity: blocker
Priority: P2
Component: -unknown
Assignee: wine-bugs(a)winehq.org
Reporter: anfanai(a)protonmail.com
CC: leslie_alistair(a)hotmail.com, z.figura12(a)gmail.com
Distribution: ---
Created attachment 63692
--> https://bugs.winehq.org/attachment.cgi?id=63692
the backtrace for the problem
iTunes crashes during the installation. I'm using version 12.9.3.3 (64-bit)
downloaded from https://www.apple.com/itunes/download/
--
Do not reply to this email, post in Bugzilla using the
above URL to reply.
You are receiving this mail because:
You are watching all bug changes.
http://bugs.winehq.org/show_bug.cgi?id=10803
Summary: iTunes 7.3 no longer functions after upgrading Wine to
0.9.51
Product: Wine
Version: 0.9.51.
Platform: PC
OS/Version: Linux
Status: UNCONFIRMED
Severity: major
Priority: P2
Component: wine-misc
AssignedTo: wine-bugs(a)winehq.org
ReportedBy: linux(a)xstylus.com
In Wine versions 0.9.50 and prior, iTunes 7.3 functions. However, when
upgrading to 0.9.51, iTunes 7.3 will no longer function.
A fresh installation of Wine 0.9.51 was installed on my machine, and then
itunes 7.3 installed. iTunes 7.3 still would not run. Reverting back to 0.9.50
would not solve the problem either.
I was only able to solve the problem by reverting to 0.9.50 AND purging my
.wine folder.
Instructions for installing Wine 7.3 can be found at:
http://wine-review.blogspot.com/2007/10/itunes-73-on-linux-with-wine.html
--
Configure bugmail: http://bugs.winehq.org/userprefs.cgi?tab=email
------- You are receiving this mail because: -------
You are watching all bug changes.
http://bugs.winehq.org/show_bug.cgi?id=24073
Summary: iTunes 9.0.0.70 crashes on first run
Product: Wine
Version: 1.3.1
Platform: x86
URL: http://www.oldapps.com/itunes.php?old_itunes=48?downlo
ad
OS/Version: Linux
Status: UNCONFIRMED
Severity: normal
Priority: P2
Component: -unknown
AssignedTo: wine-bugs(a)winehq.org
ReportedBy: rusivi1(a)gmail.com
Created an attachment (id=30267)
--> (http://bugs.winehq.org/attachment.cgi?id=30267)
wine1.3.1: wine C:\\Program\ Files\\iTunes\\iTunes.exe >>log.txt 2&>1
Compiled newest dev wine from source (1.3.1), performed iTunes install with
defaults accepted except:
+ Unclicked "Use iTunes as the default player for audio files"
+ Unclicked "Automatically update iTunes and other Apple software"
+"AutoRun is turned off. iTunes won't be able to recognize when a CD is
inserted or ejected until your computer's AutoRun setting is turned on. Do you
want iTunes to turn on AutoRun for you?" No
Upon seemingly successful install, ran for first time:
+ Unclicked "Add MP3 and AAC files"
+ Choose "Yes, keep my iTunes Media Folder organized"
+ Dialog box noting, "Warning! iTunes was not properly installed. If you wish
to import or burn CDs, you need to reinstall iTunes."
The second the iTunes GUI popped up, I got a dialog box noting how "The program
iTunes.exe has encountered a serious problem and needs to close. We are sorry
for the inconvenience. This can be caused by a program..."
--
Configure bugmail: http://bugs.winehq.org/userprefs.cgi?tab=email
Do not reply to this email, post in Bugzilla using the
above URL to reply.
------- You are receiving this mail because: -------
You are watching all bug changes.
http://bugs.winehq.org/show_bug.cgi?id=23609
Summary: iTunes 9.2 GUI bricks when opened with wine-1.2-rc7,
Ubuntu 10.04
Product: Wine
Version: 1.2-rc7
Platform: x86
OS/Version: Linux
Status: UNCONFIRMED
Severity: normal
Priority: P2
Component: -unknown
AssignedTo: wine-bugs(a)winehq.org
ReportedBy: rusivi1(a)gmail.com
Created an attachment (id=29530)
--> (http://bugs.winehq.org/attachment.cgi?id=29530)
iTunes GUI bricked
After installing a plain vanilla wine-1.2-rc7 from source, no winetricks,
downloaded and installed iTunes 9.2 from http://www.apple.com/itunes/download/
The installer ran seemingly successfully.
Open iTunes via desktop GUI icon, iTunes main screen pops up but is bricked,
nothing can be clicked and the window cannot be moved.
--
Configure bugmail: http://bugs.winehq.org/userprefs.cgi?tab=email
Do not reply to this email, post in Bugzilla using the
above URL to reply.
------- You are receiving this mail because: -------
You are watching all bug changes.
http://bugs.winehq.org/show_bug.cgi?id=32338
Bug #: 32338
Summary: iTunes 11: crashes when running
Product: Wine
Version: 1.5.18
Platform: x86
OS/Version: Linux
Status: UNCONFIRMED
Severity: normal
Priority: P2
Component: -unknown
AssignedTo: wine-bugs(a)winehq.org
ReportedBy: jactry92(a)gmail.com
Classification: Unclassified
Created attachment 42681
--> http://bugs.winehq.org/attachment.cgi?id=42681
The Log
reproduce follow this:
0. download and instll it, I install it with deatulf option in the
installation;
1. 'winetricks -q gdiplus' to get a workaround for Bug 30623 ;
2. cd to the path where installed it and 'wine iTunes.exe' to run it;
3. just wait for it crashes wine...
I tested this a enough times and it crashed every time.
My test environment:
- Ubuntu 12.10 32 bit
- Wine 1.5.18
- iTunes 11
--
Configure bugmail: http://bugs.winehq.org/userprefs.cgi?tab=email
Do not reply to this email, post in Bugzilla using the
above URL to reply.
------- You are receiving this mail because: -------
You are watching all bug changes.
http://bugs.winehq.org/show_bug.cgi?id=34964
Bug #: 34964
Summary: Fails to prompt for Authentication.
Product: Wine
Version: 1.5.17
Platform: x86
OS/Version: Linux
Status: NEW
Severity: normal
Priority: P2
Component: mshtml
AssignedTo: wine-bugs(a)winehq.org
ReportedBy: leslie_alistair(a)hotmail.com
Classification: Unclassified
wine iexplore http://sparxsystems.com/registered/index.html
The prompt for the username and password should appear but instead you get
"Authorization Required
This server could not verify that you are authorized to access the document
requested. Either you supplied the wrong credentials (e.g., bad password), or
your browser doesn't understand how to supply the credentials required."
--
Configure bugmail: http://bugs.winehq.org/userprefs.cgi?tab=email
Do not reply to this email, post in Bugzilla using the
above URL to reply.
------- You are receiving this mail because: -------
You are watching all bug changes.
http://bugs.winehq.org/show_bug.cgi?id=35383
Bug ID: 35383
Summary: iTunes 11.1.3.8 not usable, empty main window
Product: Wine
Version: 1.7.10
Hardware: x86
OS: Linux
Status: UNCONFIRMED
Severity: normal
Priority: P2
Component: -unknown
Assignee: wine-bugs(a)winehq.org
Reporter: af(a)muc.de
Classification: Unclassified
Created attachment 47198
--> http://bugs.winehq.org/attachment.cgi?id=47198
This is how iTunes 11.1.3.8 looks under wine 1.7.10
Installing iTunes (32 bit version) works. Starting it up only an empty window
is visible (see attached screenshot and the report in the AppDB).
During startup a popup appears with a message, that for importing and burning
audio CDs, iTunes must be reinstalled to make this work.
Also tried with the 64 bit version and wine x86_64, but there a lot more
problems occur (see AppDB report).
So almost nothing can be done with iTunes. What is a pity, because this is the
only reason a copy of Microsoft Windows is still running at home.
--
Do not reply to this email, post in Bugzilla using the
above URL to reply.
You are receiving this mail because:
You are watching all bug changes.
http://bugs.winehq.org/show_bug.cgi?id=22177
Summary: Standalone version of DivX fails to install
Product: Wine
Version: 1.1.41
Platform: x86
URL: http://download.divx.com/divx/standalone/DivXInstaller
.exe
OS/Version: Linux
Status: UNCONFIRMED
Severity: normal
Priority: P2
Component: -unknown
AssignedTo: wine-bugs(a)winehq.org
ReportedBy: lukasz.wojnilowicz(a)gmail.com
Created an attachment (id=27057)
--> (http://bugs.winehq.org/attachment.cgi?id=27057)
Terminal output on Wine 1.1.41
Steps to reroduce:
1) remove ~/.wine
2) wine DivXInstaller.exe
3) accept licence and press next
4) get Wine error
--
Configure bugmail: http://bugs.winehq.org/userprefs.cgi?tab=email
Do not reply to this email, post in Bugzilla using the
above URL to reply.
------- You are receiving this mail because: -------
You are watching all bug changes.
https://bugs.winehq.org/show_bug.cgi?id=49010
Bug ID: 49010
Summary: ilok license manager: doesn't connect to the
activation server as in 4.0.2
Product: Wine
Version: 5.0
Hardware: x86
OS: Linux
Status: UNCONFIRMED
Severity: normal
Priority: P2
Component: -unknown
Assignee: wine-bugs(a)winehq.org
Reporter: fsciarra62(a)gmail.com
Distribution: ---
Created attachment 66985
--> https://bugs.winehq.org/attachment.cgi?id=66985
Image shown at application startup
Hi,
iLok License Manager application doesn't work in wine 5.0 (reported by wine
--version) in ubuntu studio 20.04 for amd64.
The application is perfectly working in my ubuntu studio 19.10 with wine 4.0.2.
iLok License Manager is a free application and can be downloaded from this
page:
https://www.ilok.com/#!license-manager
Here is the direct link to the zip file:
http://installers.ilok.com/iloklicensemanager/LicenseSupportInstallerWin64.…
At startup, as shown in the attachment, the application complains that it is
not possible to connect to the server. This doesn't allow me to move my
installed license nor to install new software.
The same application starts perfectly in ubuntu studio 19.10. I have double
checked it several times.
This application is crucial for musicians to authorize highly professional VST
plugins. In order to check the behavior with plugins, it is possible to ask for
trial versions of Eventide VST software from their site, eg:
https://www.eventideaudio.com/products/effects/band-delays/h3000-band-delays
There is a button to request a demo version, working for 30 days.
To request the plugin and activate the license you need an account created on
www.ilok.com and then use the License manager to authorize it on the local
computer. To install on another computer, you have to use the License Manager
to deauthorize the local version, or the software is lost.
I'm at your disposal for any information and help.
Best regards,
Fabrizio
--
Do not reply to this email, post in Bugzilla using the
above URL to reply.
You are receiving this mail because:
You are watching all bug changes.
http://bugs.winehq.org/show_bug.cgi?id=35709
Bug ID: 35709
Summary: PhotoNinja 1.2.3 64bit crashes at startup
Product: Wine
Version: 1.7.13
Hardware: x86
OS: Linux
Status: UNCONFIRMED
Severity: normal
Priority: P2
Component: kernel32
Assignee: wine-bugs(a)winehq.org
Reporter: jpn_almeida(a)hotmail.com
The 64 bit version of PhotoNinja crashes at startup, right after loading and
showing up the thumbnails (the 32bit version loads successfully).
--
Do not reply to this email, post in Bugzilla using the
above URL to reply.
You are receiving this mail because:
You are watching all bug changes.
https://bugs.winehq.org/show_bug.cgi?id=38484
Bug ID: 38484
Summary: The ZMR game does not open.
Product: Wine
Version: 1.7.41
Hardware: x86-64
OS: Linux
Status: UNCONFIRMED
Severity: normal
Priority: P2
Component: -unknown
Assignee: wine-bugs(a)winehq.org
Reporter: 4i20(a)mail.com
Distribution: ---
Created attachment 51325
--> https://bugs.winehq.org/attachment.cgi?id=51325
logDebugger
The ZMR game does not open.
About the game: http://zmr.enmasse.com/
Thanks for any help, stay with God.
--
Do not reply to this email, post in Bugzilla using the
above URL to reply.
You are receiving this mail because:
You are watching all bug changes.
http://bugs.winehq.org/show_bug.cgi?id=12071
Summary: MSI SQL joins on tables with many rows are extremely
slow
Product: Wine
Version: 0.9.57.
Platform: PC
OS/Version: Linux
Status: NEW
Severity: enhancement
Priority: P2
Component: msi
AssignedTo: truiken(a)gmail.com
ReportedBy: truiken(a)gmail.com
CC: ead1234(a)hotmail.com
With the current implementation of MSI SQL joins, we perform a Cartesian
product on the tables joined together. In the case where there is no WHERE
clause, this is the correct output, but if there is a WHERE clause, we still
perform the Cartesian product and then filter on the WHERE clause. Though it's
uncommon, there are a few installers (Visual Studio, Nero Express 7) that join
tables with thousands of rows. For example, say we have tables A, B, and C
s.t.
colA colB colC
----- ----- -----
1 1 1
2 2 2
... ... ...
1000 1000 1000
and we have the query
SELECT * FROM A, B, C WHERE `colA`=1 AND `colB`=1 AND `colC`=1
then the current implementation will create a new table with those columns
containing 1000*1000*1000=1 billion rows. Then we check each of the 1 billion
rows for any matches. There are several algorithms for optimizing joins:
http://en.wikipedia.org/wiki/Join_(SQL)#Join_algorithms
The solution I'll be working on is the merge join. This solution parses the
WHERE clause, starting with the two tables that the columns of the clause
belong to (colA -> A, colB -> B, etc) and joins those together, making sure to
eliminate rows based on the WHERE clause. Then the next table in the clause is
merged into the previously created table, eliminating rows. This continues
until there are no tables left. One optimization of this solution is to start
with parts of the WHERE clause that compare against literals. For example, the
query:
SELECT * FROM A, B, C WHERE `colA` = `colB` AND `colB` = 1 AND `colC` = 1
We'd start with "`colB` = 1" since the comparison is against a literal. We
perform 1000 comparisons on the rows of table B (count = 1000). The resulting
table is:
colB
----
1
then we do the same for table C (count = 1000), and the merged table is:
colB colC
---- ----
1 1
next we merge this table with table A:
colA colB colC
---- ---- ----
1 1 1
2 1 1
... ... ...
1000 1 1
and we search through this table for the condition `colA` = `colB` (count =
1000). So we've reduced billions of comparisons to 3000.
Unfortunately, the way our SQL engine is implemented, this will not be an easy
task.
--
Configure bugmail: http://bugs.winehq.org/userprefs.cgi?tab=email
Do not reply to this email, post in Bugzilla using the
above URL to reply.
------- You are receiving this mail because: -------
You are watching all bug changes.
http://bugs.winehq.org/show_bug.cgi?id=26010
Summary: NI_Multisim won't install
Product: Wine
Version: 1.3.9
Platform: x86
OS/Version: Linux
Status: UNCONFIRMED
Severity: normal
Priority: P2
Component: msi
AssignedTo: wine-bugs(a)winehq.org
ReportedBy: business.kid(a)gmail.com
http://www.ni.com/multisim/
I have given this a garbage rating and the page says to file a bug, so here
goes.
You register, and it gives you a downloader. Running the downloader, it slowly
downloads 464mb and writes a file of length 0 bytes :-//. So I used m$, which
is in the house, to download, and tried installing. I have a user set up just
for this, so I can wipe, hack, etc without upsetting anything.
After previous failed attempts I read errors and ran
winetricks gecko corefonts dotnet20sp2 vcrun6sp6 and stuck in dlls as native,
but that didn't help
It seems to want to do these steps
1. Unzip to C:\National Instruments Download - with coaxing it succeeds.
msiexec.exe & setup.exe each consume 49.x% of cpu. msiexec.exe rises to 99% if
keyboard input is wanted. msiexec then took off and grabbed the cpu with no
keyboard input wanted, so I killed it and setup moved on.
2. Next step is to take my name, license number (I used the trial version
option) and setup.exe grabs the cpu until it bombs. It actually works, but I
gather some threads are idle or have crashed, and idle seems to grab full cpu.
It spews msi errors - sampled below
fixme:msi:MsiGetFeatureValidStatesW 1 L"Core.MIFMUI" 0xfce320 stub returning 8
fixme:volume:GetVolumePathNameW (L"C:\\Program Files\\", 0x865818, 19), stub!
fixme:sxs:cache_QueryAssemblyInfo 0x2233470, 0x00000001, L"Microsoft.VC80.CRT,
version=8.0.50727.4053, publicKeyToken=1fc8b3b9a1e18e3b,
processorArchitecture=x86", 0x20fe1d8
fixme:msi:msi_unimplemented_action_stub MsiUnpublishAssemblies -> 10 ignored
L"MsiAssembly" table values
err:msi:ITERATE_Actions Execution halted, action
L"DD_CA_ComregEnterpriseServicesRB_X86.3643236F_FC70_11D3_A536_0090278A1BB8"
returned 1603
fixme:msi:MsiGetMode unimplemented run mode: 0
fixme:advapi:SetNamedSecurityInfoW L"[AAAAAA.LV.NIEF900]\\" 1 4 (nil) (nil)
0x2267efc (nil)
The output onscreen is "Installing .NET 2.0" (already installed) It's step 2 of
6 on the Elvis install, and step 5 of 33 on the full multisim install. After
more msi errors than I considered possible, it craps out executing invalid
instructions on an seh error.
if left running for several hours, it will make C:\National Instruments fill
that with about 500 Megs. It does install a Program\ Filed/blah/blah/Shared
directory with 150 Megs of 8--megs - 1 gig expected.
I have this user here. Tell me what debug trace you'd like and I'll run it.
--
Configure bugmail: http://bugs.winehq.org/userprefs.cgi?tab=email
Do not reply to this email, post in Bugzilla using the
above URL to reply.
------- You are receiving this mail because: -------
You are watching all bug changes.
http://bugs.winehq.org/show_bug.cgi?id=10314
Summary: Switched On Schoolhouse 2000 fails to start up
Product: Wine
Version: CVS/GIT
Platform: Other
URL: http://www.familychristianacademy.com/SOStest.html
OS/Version: other
Status: NEW
Keywords: download
Severity: enhancement
Priority: P2
Component: wine-misc
AssignedTo: wine-bugs(a)winehq.org
ReportedBy: dank(a)kegel.com
While looking at bug 10313, I went looking for a
freely downloadable version of Switched-on Schoolhouse.
The only thing I found so far was a free downloadable placement test
for a school which seems to have been
made with Switched On Schoolhouse 2000.
When you run it, it locks up your X session, and you have
to do alt-control-backspace to shut down the X server
to regain control.
--
Configure bugmail: http://bugs.winehq.org/userprefs.cgi?tab=email
------- You are receiving this mail because: -------
You are watching all bug changes.
http://bugs.winehq.org/show_bug.cgi?id=25343
Summary: mstsc fails when using rdp 7 client protocol
Product: Wine
Version: unspecified
Platform: x86
OS/Version: Linux
Status: UNCONFIRMED
Severity: blocker
Priority: P2
Component: ntdll
AssignedTo: wine-bugs(a)winehq.org
ReportedBy: rgilland1966(a)gmail.com
mstsc fails when using rdp 7 client protocol
error is critical failure
--
Configure bugmail: http://bugs.winehq.org/userprefs.cgi?tab=email
Do not reply to this email, post in Bugzilla using the
above URL to reply.
------- You are receiving this mail because: -------
You are watching all bug changes.
http://bugs.winehq.org/show_bug.cgi?id=15270
Summary: Newest MapSource version (6.14.1) doesn't run anymore
with wine 1.1.4
Product: Wine
Version: 1.1.4
Platform: PC
OS/Version: Linux
Status: UNCONFIRMED
Severity: blocker
Priority: P2
Component: -unknown
AssignedTo: wine-bugs(a)winehq.org
ReportedBy: sbuehne(a)web.de
Created an attachment (id=16066)
--> (http://bugs.winehq.org/attachment.cgi?id=16066)
wine error during startup of mapsource
I could run successfully mapsource version 6.11 inlcuding all functions with
wine version 1.1.4 on openSuse 11.0
After applying an upgrade to the software mapsource, wine crashes during
program start with the error message:
...
wine: Unhandled page fault on write access to 0x003c1000 at address 0x9863ab
(thread 0009), starting debugger...
Unhandled exception: page fault on write access to 0x003c1000 in 32-bit code
(0x009863ab).
Register dump:
CS:0073 SS:007b DS:007b ES:007b FS:0033 GS:003b
EIP:009863ab ESP:0033e0b8 EBP:0033e0c0 EFLAGS:00010202( - 00 - -RI1)
EAX:003c0000 EBX:011d0d70 ECX:01ffffce EDX:00000000
ESI:011d1d70 EDI:003c1000
..
I have created a trace file for this error with the command:
echo quit | WINEDEBUG=+relay wine MapSource.exe >& filename.out;
and tailed the last 1000 lines to the attached log file, inlcuding the error
message.
--
Configure bugmail: http://bugs.winehq.org/userprefs.cgi?tab=email
Do not reply to this email, post in Bugzilla using the
above URL to reply.
------- You are receiving this mail because: -------
You are watching all bug changes.
http://bugs.winehq.org/show_bug.cgi?id=29212
Bug #: 29212
Summary: Pegasus Mail v. 4.62 build 191 generates msg "Invalid
variant type" & "Invalid variant operation"
Product: Wine
Version: 1.3.33
Platform: x86
URL: http://download-us.pmail.com/w32-462.exe
OS/Version: Linux
Status: UNCONFIRMED
Severity: normal
Priority: P2
Component: -unknown
AssignedTo: wine-bugs(a)winehq.org
ReportedBy: mccarthy(a)volny.cz
Classification: Unclassified
Created attachment 37716
--> http://bugs.winehq.org/attachment.cgi?id=37716
debug log
wine 1.3.33
Pegasus Mail: v4.62 build 191
IERendered: 2.4.5.18 disabled
Upon start up, Pmail generates two messages: Invalid variant type and Invalid
variant operation
--
Configure bugmail: http://bugs.winehq.org/userprefs.cgi?tab=email
Do not reply to this email, post in Bugzilla using the
above URL to reply.
------- You are receiving this mail because: -------
You are watching all bug changes.
http://bugs.winehq.org/show_bug.cgi?id=18330
Summary: MapSource won't recognize Garmin Edge 705 via
MassStorage
Product: Wine
Version: 1.1.20
Platform: PC
OS/Version: Linux
Status: UNCONFIRMED
Severity: normal
Priority: P2
Component: -unknown
AssignedTo: wine-bugs(a)winehq.org
ReportedBy: Erbureth(a)seznam.cz
Created an attachment (id=20872)
--> (http://bugs.winehq.org/attachment.cgi?id=20872)
Full log from MapSource 6.13.5 in wine 1.1.20 run.
Last few versions of Wine, I have not been able to use MapSource 6.13.5
software with my Garmin Edge705 unit to it's full extent, for MapSource is
unable to recognize the unit and therefore it cannot communicate with. Last
time it worked, I was using Wine 1.0.0, and when I downgraded from 1.1.20 to
1.0.1, it worked again. Wine log is attached. If there are any other tests I
can perform to help diagnose the problem, just let me know.
--
Configure bugmail: http://bugs.winehq.org/userprefs.cgi?tab=email
Do not reply to this email, post in Bugzilla using the
above URL to reply.
------- You are receiving this mail because: -------
You are watching all bug changes.
https://bugs.winehq.org/show_bug.cgi?id=42609
Bug ID: 42609
Summary: Rockstar Games Social Club crashes with subprocess.exe
Product: Wine
Version: 2.3
Hardware: x86-64
OS: Linux
Status: NEW
Severity: normal
Priority: P2
Component: -unknown
Assignee: wine-bugs(a)winehq.org
Reporter: andrey.goosev(a)gmail.com
Distribution: ---
Created attachment 57554
--> https://bugs.winehq.org/attachment.cgi?id=57554
backtrace
After launching Max Payne 3 Rockstar Games Social Club crashes with
subprocess.exe and after hitting 'Close' button crash repeats.
Also game stuck at Initializing process.
fixme:dxgi:dxgi_swapchain_Present Unimplemented flags 0x1
fixme:dxgi:dxgi_swapchain_GetDesc iface 0x2e3d55a8, desc 0x2ebbe0f8 partial
stub!
fixme:dxgi:dxgi_swapchain_GetDesc Ignoring ScanlineOrdering, Scaling and
SwapEffect.
fixme:system:IsProcessDPIAware stub!
fixme:dxgi:dxgi_swapchain_Present Unimplemented flags 0x1
fixme:dxgi:dxgi_swapchain_Present Unimplemented sync interval 1
wine-2.3-67-g9eecacb
--
Do not reply to this email, post in Bugzilla using the
above URL to reply.
You are receiving this mail because:
You are watching all bug changes.
http://bugs.winehq.org/show_bug.cgi?id=12527
Summary: radio button groups don't work with up/down arrow keys
Product: Wine
Version: CVS/GIT
Platform: PC
URL: http://winmerge.org/
OS/Version: Linux
Status: UNCONFIRMED
Severity: normal
Priority: P2
Component: user32
AssignedTo: wine-bugs(a)winehq.org
ReportedBy: msclrhd(a)gmail.com
1. Open an application that has a radio button group, e.g.:
* WinMerge (http://winmerge.org/)
* Some installers
I will use WinMerge as the example for the rest of this bug report:
2. Press Ctrl+N to create a new document
3. Enter "A" in the "Untitled left pane"
4. Enter "B" in the "Untitled right pane"
5. Close the application
This will bring up a "Save modified files?" dialog. NOTE: Using tab to navigate
around the dialog sets the focus to the correct items in the correct sequence.
6. Press the left mouse button on one of the "Save changes" radio buttons
7. Press the down arrow key
This should select the "Discard changes" radio button. The button has the
focus, but is not selected. As a workaround, pressing the space key will select
the button.
8. Press the down arrow key
This should select the "Save changes" radio button, cycling the radio button
grouping. This does not work. If you are on the bottom group, it selects the
"Discard All" button. If you are on the top group, no item is selected and
pressing the down arrow key again selects the "Untitled right" edit box.
9. Press the left mouse button on one of the "Discard changes" radio buttons
10. Press the up arrow key
This should select the "Save changes" radio button. The button has the focus,
but is not selected. As a workaround, pressing the space key will select the
button.
11. Press the up arrow key
This should select the "Discard changes" radio button, cycling the radio button
grouping. This does not work. If you are on the bottom group, it selects the
"Untitled left" edit box. If you are on the top group, it selects the "Untitled
right" edit box.
--
Configure bugmail: http://bugs.winehq.org/userprefs.cgi?tab=email
Do not reply to this email, post in Bugzilla using the
above URL to reply.
------- You are receiving this mail because: -------
You are watching all bug changes.
http://bugs.winehq.org/show_bug.cgi?id=16845
Summary: Radio buttons not being checked on focus
Product: Wine
Version: CVS/GIT
Platform: Other
URL: http://www.chiark.greenend.org.uk/~sgtatham/putty/downlo
ad.html
OS/Version: other
Status: UNCONFIRMED
Severity: enhancement
Priority: P2
Component: user32
AssignedTo: wine-bugs(a)winehq.org
ReportedBy: munozferna(a)gmail.com
Current wine behavior is to just assign the focus to the radio button, however,
Windows checks the radio button when it gets focus through the keyboard arrows.
Steps to reproduce:
1. Open putty
2. Click the Raw radio button
3. Press right arrow twice
Actual results
* Port textbox stays at 23
* Rlogin radio button is not checked
Expected results (windows behavior)
* Port textbox changes to 513
* Rlogin radio button is checked
I'm attaching a patch that I believe fixes this, comments about it would be
appreciated.
--
Configure bugmail: http://bugs.winehq.org/userprefs.cgi?tab=email
Do not reply to this email, post in Bugzilla using the
above URL to reply.
------- You are receiving this mail because: -------
You are watching all bug changes.
http://bugs.winehq.org/show_bug.cgi?id=11095
Summary: some keyboard shortcuts do not work in the celestia
installer
Product: Wine
Version: 0.9.52.
Platform: PC
OS/Version: Linux
Status: NEW
Keywords: download
Severity: trivial
Priority: P2
Component: -unknown
AssignedTo: wine-bugs(a)winehq.org
ReportedBy: thestig(a)google.com
I've seen this problem in some programs, but not others. Here's one problem
where it happens:
In the Celestia installer, on the initial page, it asks you to accept the GPL
license. By default, the radio button has "do not accept" selected.
On Windows, I can press "alt + a" to select the "accept" radio button. On Wine,
the "accept" button gets focus when I press "alt + a", but the radio button
doesn't get selected.
--
Configure bugmail: http://bugs.winehq.org/userprefs.cgi?tab=email
------- You are receiving this mail because: -------
You are watching all bug changes.
http://bugs.winehq.org/show_bug.cgi?id=23525
Summary: Daytona USA Evolutions: some text/graphics are black,
should be colored
Product: Wine
Version: 1.2-rc6
Platform: x86
URL: http://sega.jp/pc/daytonae/trial.shtml
OS/Version: Linux
Status: NEW
Keywords: download
Severity: trivial
Priority: P2
Component: -unknown
AssignedTo: wine-bugs(a)winehq.org
ReportedBy: austinenglish(a)gmail.com
Created an attachment (id=29366)
--> (http://bugs.winehq.org/attachment.cgi?id=29366)
wine screenshot
It's an old Direct 6.1 game...luckily, it's got a free download (only 42 mb).
Run the game, press enter repeatedly, and start the game. You'll see your car,
but the speedometer/time/etc. are all black. I'll attach a windows screenshot
for comparison.
Terminal output is pretty short:
fixme:win:WINNLSEnableIME hUnknown1 (nil) bUnknown2 0: stub!
fixme:win:EnumDisplayDevicesW ((null),0,0x33f1a8,0x00000000), stub!
fixme:dsalsa:IDsDriverBufferImpl_SetVolumePan (0x164150,0x164098): stub
fixme:d3d:swapchain_init The application requested more than one back buffer,
this is not properly supported.
Please configure the application to use double buffering (1 back buffer) if
possible.
fixme:heap:RtlCompactHeap (0x110000, 0x0) stub
err:ole:CoUninitialize Mismatched CoUninitialize
fixme:d3d:IWineD3DDeviceImpl_Release (0x1584e0) Device released with resources
still bound, acceptable but unexpected
fixme:d3d:IWineD3DDeviceImpl_Release Leftover resource 0x342ced0 with type
WINED3DRTYPE_SURFACE (0x1).
fixme:d3d:IWineD3DDeviceImpl_Release Leftover resource 0x3417c90 with type
WINED3DRTYPE_SURFACE (0x1).
fixme:d3d:IWineD3DDeviceImpl_Release Leftover resource 0x342ea78 with type
WINED3DRTYPE_SURFACE (0x1).
fixme:d3d:IWineD3DDeviceImpl_Release Leftover resource 0x38bb6d8 with type
WINED3DRTYPE_SURFACE (0x1).
--
Configure bugmail: http://bugs.winehq.org/userprefs.cgi?tab=email
Do not reply to this email, post in Bugzilla using the
above URL to reply.
------- You are receiving this mail because: -------
You are watching all bug changes.
http://bugs.winehq.org/show_bug.cgi?id=31348
Bug #: 31348
Summary: Can't select the file from popup
Product: Wine
Version: 1.5.9
Platform: x86
OS/Version: Mac OS X
Status: UNCONFIRMED
Severity: normal
Priority: P2
Component: user32
AssignedTo: wine-bugs(a)winehq.org
ReportedBy: kenorb(a)gmail.com
Classification: Unclassified
I'm using the software called: EX4-TO-MQ4 Decompiler 4.0.427 (Demo)
Free available from: http://purebeam.biz/#download_decompiler
But it doesn't work, because I can't select the file.
Here are some logs:
I'm starting it:
$ wine ex4_to_mq4_demo.exe
fixme:msg:ChangeWindowMessageFilter 233 00000001
fixme:msg:ChangeWindowMessageFilter 4a 00000001
fixme:msg:ChangeWindowMessageFilter 49 00000001
fixme:win:WINNLSEnableIME hwnd 0x10098 enable 0: stub!
fixme:win:WINNLSEnableIME hwnd 0x10098 enable -1: stub!
fixme:win:WINNLSEnableIME hwnd 0x10098 enable 0: stub!
fixme:win:WINNLSEnableIME hwnd 0x10098 enable -1: stub!
(last message repeats couple of times with 0 and -1, possible when the
application is focus or not).
Then I'm clicking 'Decompile...' button to select the file.
I've following logs:
fixme:commdlg:IServiceProvider_fnQueryService Interface
{e07010ec-bc17-44c0-97b0-46c7c95b9edc} requested from unknown service
{e07010ec-bc17-44c0-97b0-46c7c95b9edc}
fixme:shell:ViewModeToListStyle ViewMode 0 not implemented
fixme:shell:IShellBrowser_fnSendControlMsg stub, 0x164e20 (2, 1026, a003, 0,
0x33e93c)
fixme:shell:IShellBrowser_fnSendControlMsg stub, 0x164e20 (2, 1026, a004, 0,
0x33e93c)
fixme:shell:IShellBrowser_fnSendControlMsg stub, 0x164e20 (2, 1025, a003, 1,
0x33e93c)
fixme:shell:IShellBrowser_fnSendControlMsg stub, 0x164e20 (2, 1025, a004, 1,
0x33e93c)
fixme:nstc:NSTC2_fnSetControlStyle2 mask & style (0x00000004) contains
unsupported style(s): 0x00000004
fixme:win:WINNLSEnableIME hwnd 0x10098 enable -1: stub!
The file selection popup appeared, so I can select the file.
Once I've clicked on the file, I've following messages:
fixme:uniscribe:GPOS_apply_lookup We do not handle SubType 6
fixme:uniscribe:GPOS_apply_lookup We do not handle SubType 6
(last message repeats around 40 times more at the same time)
fixme:shell:IShellBrowser_fnOnViewWindowActive stub, 0x164e20 (0x165368)
Selecting the file (some.ex4), I've following messages:
fixme:win:WINNLSEnableIME hwnd 0x10098 enable 0: stub!
fixme:uniscribe:GPOS_apply_lookup We do not handle SubType 6
(the last message - many of them)
fixme:win:WINNLSEnableIME hwnd 0x10098 enable -1: stub!
fixme:shell:IShellItemArray_fnEnumItems Stub: 0x173c40 (0x33f83c)
After that no files were selected.
Also I can't type manually in 'File' textbox.
The other think which doesn't work, is dropping the file, but I assume it's not
supported in Wine.
I've seen some similar errors in following tickets:
http://bugs.winehq.org/show_bug.cgi?id=27936http://bugs.winehq.org/show_bug.cgi?id=23525http://bugs.winehq.org/show_bug.cgi?id=11095
And those somebody else pastebins contains exact message which I've:
http://pastebin.com/rx9xRPKYhttp://pastebin.com/QW8T25Xh
which is: 'fixme:win:WINNLSEnableIME hwnd 0x10098 enable 0: stub!'
Basically my goals is to try this program, but it simply doesn't work as
expected.
P.S. I've compiled latest version from Git from the sources on Mac, so
eventually I could apply some patches or write some (if I'll have some good
directions) to test it.
Thank you.
--
Configure bugmail: http://bugs.winehq.org/userprefs.cgi?tab=email
Do not reply to this email, post in Bugzilla using the
above URL to reply.
------- You are receiving this mail because: -------
You are watching all bug changes.
https://bugs.winehq.org/show_bug.cgi?id=48944
Bug ID: 48944
Summary: Default to x86_64 as hardware architecture
Product: WineHQ Bugzilla
Version: unspecified
Hardware: x86
OS: Linux
Status: UNCONFIRMED
Severity: normal
Priority: P2
Component: bugzilla-unknown
Assignee: wine-bugs(a)winehq.org
Reporter: sashok.olen(a)gmail.com
CC: austinenglish(a)gmail.com
Distribution: ---
The year is 2020 and x86_64 has pretty much completely superseded 32-bit x86
processors with many operating systems dropping 32-bit support left and right,
thus Bugzilla should use x86_64 as default value for "Hardware" field for new
bug reports, especially since many overlook this field and forget to change it
(which is an issue too) or assume that `x86` value includes 64-bit variety of
processors as well.
--
Do not reply to this email, post in Bugzilla using the
above URL to reply.
You are receiving this mail because:
You are watching all bug changes.
https://bugs.winehq.org/show_bug.cgi?id=47963
Bug ID: 47963
Summary: Error when submitting a new application to the AppDB
Product: WineHQ Apps Database
Version: unspecified
Hardware: x86
OS: Linux
Status: NEW
Severity: normal
Priority: P2
Component: appdb-unknown
Assignee: wine-bugs(a)winehq.org
Reporter: dimesio(a)earthlink.net
Distribution: ---
I assume this is related to the recent upgrade to PHP7.
When trying to submit a new application to the AppDB, it errors out with this
message:
Ooops! Something has gone terribly wrong!
Our monkey train has derailed! Worry not, a webmaster gopher help army has been
dispatched and is on the way.
If this error continues to be a problem, please report it to us on our Forums
error details:
Error Message: Database Error: Incorrect integer value: '' for column
`apidb`.`appMaintainers`.`versionId` at row 1 Comment:
File: query.php:149
The application entry is created, but it is missing the version information and
test results.
https://appdb.winehq.org/objectManager.php?sClass=application&iId=19597 is an
example.
A couple of forum users have reported a similar error when submitting a new
version. https://forum.winehq.org/viewtopic.php?f=11&t=33007
--
Do not reply to this email, post in Bugzilla using the
above URL to reply.
You are receiving this mail because:
You are watching all bug changes.
https://bugs.winehq.org/show_bug.cgi?id=46264
Bug ID: 46264
Summary: crushing of programm tygemglobal.exe
Product: Wine
Version: 3.0.4
Hardware: x86-64
OS: Linux
Status: UNCONFIRMED
Severity: normal
Priority: P2
Component: -unknown
Assignee: wine-bugs(a)winehq.org
Reporter: patrik.macek1(a)gmail.com
Distribution: ---
Created attachment 62968
--> https://bugs.winehq.org/attachment.cgi?id=62968
logfile
running program - tygemglobal.exe is crushing. not immediately, but after short
time of running the programm. with previous version of wine this behaivior was
not there
--
Do not reply to this email, post in Bugzilla using the
above URL to reply.
You are receiving this mail because:
You are watching all bug changes.
https://bugs.winehq.org/show_bug.cgi?id=45817
Bug ID: 45817
Summary: foobar2000 GUI transparency broken ("playlist tab drag
target" has opaque background)
Product: Wine
Version: 3.15
Hardware: x86-64
OS: Linux
Status: UNCONFIRMED
Severity: normal
Priority: P2
Component: -unknown
Assignee: wine-bugs(a)winehq.org
Reporter: jimbo1qaz(a)gmail.com
Distribution: ---
Created attachment 62277
--> https://bugs.winehq.org/attachment.cgi?id=62277
foobar2000 tab-drag icon bug (virtualbox)
In foobar2000, dragging a playlist tab (for example Default tab) creates a
T-shaped icon depicting the new position of the tab.
In Wine 3.15 in Debian Virtualbox (KDE with compositor=XRender), the icon is
rendered with a light-green background #eeffc0 instead of transparency. (hmm,
it's byteswapped c0ffee, is this intentional?) When I move my cursor away from
the tab bar, both the cursor and the background color fade out normally.
On my Kubuntu dual-boot without Virtualbox, I get a massive rectangle of
corrupted memory. Maybe my Intel i5-6200U GPU drivers are at fault, as I get
random corruption in KDE including transparent/flickering titlebars without
Wine running. I mostly worked around them by switching to XRender.
--------------
Additionally when I run foobar2000 with Wine without no audio output, and open
Preferences (Ctrl+P) and click on Playback/Output, "Device" is blank and I get
a popup "Please select a valid output device". The bug is the popup's
background appears to be uninitialized memory.
(Fun fact: The popup remains always on top, even when you switch windows and
move them over foobar2000. xkill and clicking the popup does nothing.)
--
Do not reply to this email, post in Bugzilla using the
above URL to reply.
You are receiving this mail because:
You are watching all bug changes.
https://bugs.winehq.org/show_bug.cgi?id=44358
Bug ID: 44358
Summary: FaceIt client doesn't allow registration
Product: Wine
Version: 3.0-rc6
Hardware: x86
URL: https://cdn.faceit.com/electron/release/FACEIT-setup-l
atest.exe
OS: Linux
Status: NEW
Keywords: download
Severity: normal
Priority: P2
Component: -unknown
Assignee: wine-bugs(a)winehq.org
Reporter: dark.shadow4(a)web.de
Blocks: 44355
Distribution: ---
To use the program one needs an account, but the client doesn't allow
registration: "Email Addresses from that domain are not permitted."
It works on my Win7 VM, but but on wine-3.0-rc6 and wine-staging-2.21.
--
Do not reply to this email, post in Bugzilla using the
above URL to reply.
You are receiving this mail because:
You are watching all bug changes.
http://bugs.winehq.org/show_bug.cgi?id=33292
Bug #: 33292
Summary: Vietcong: Disc can't be authenticated
Product: Wine
Version: 1.5.26
Platform: x86-64
OS/Version: Linux
Status: UNCONFIRMED
Severity: normal
Priority: P2
Component: -unknown
AssignedTo: wine-bugs(a)winehq.org
ReportedBy: sworddragon2(a)aol.com
Classification: Unclassified
Starting Vietcong with the original disc will result the most times in the
error message "Unable to authenticate original disc within time limit.".
Clicking on "Retry" will continue the authentication process but the vietcong
process will then close after a few seconds. The only message the terminal is
showing is "fixme:ntdll:server_ioctl_file Unsupported ioctl 2d1400 (device=2d
access=0 func=500 method=0)".
--
Configure bugmail: http://bugs.winehq.org/userprefs.cgi?tab=email
Do not reply to this email, post in Bugzilla using the
above URL to reply.
------- You are receiving this mail because: -------
You are watching all bug changes.
https://bugs.winehq.org/show_bug.cgi?id=45235
Bug ID: 45235
Summary: Adobe Digital Editions 2.0.1 not running
Product: Wine
Version: 3.0
Hardware: x86
OS: Linux
Status: UNCONFIRMED
Severity: normal
Priority: P2
Component: -unknown
Assignee: wine-bugs(a)winehq.org
Reporter: peer_1(a)yahoo.de
Distribution: ---
Created attachment 61465
--> https://bugs.winehq.org/attachment.cgi?id=61465
Debug file created by wine
After installing a new prefix, I installed windowscodecs and corefonts. I was
finally able to install dotnetfx35 SP1 but ADE still won't work.
It is installed but crashes with the attached log.
--
Do not reply to this email, post in Bugzilla using the
above URL to reply.
You are receiving this mail because:
You are watching all bug changes.
https://bugs.winehq.org/show_bug.cgi?id=49287
Bug ID: 49287
Summary: Desperados 3 Demo only shows a black screen with a
styled cursor
Product: Wine
Version: 5.9
Hardware: x86-64
OS: Linux
Status: UNCONFIRMED
Severity: normal
Priority: P2
Component: -unknown
Assignee: wine-bugs(a)winehq.org
Reporter: blue-t(a)web.de
Distribution: ---
Created attachment 67292
--> https://bugs.winehq.org/attachment.cgi?id=67292
DebugOutput
Running the Desperados 3 Demo instead of the start menu, we only see the cursor
on a black screen.
This seems to be due to missing mfplat functions. I suspect there should be a
video showing on the screen instead.
--
Do not reply to this email, post in Bugzilla using the
above URL to reply.
You are receiving this mail because:
You are watching all bug changes.
https://bugs.winehq.org/show_bug.cgi?id=43306
Bug ID: 43306
Summary: LEGO Harry Potter unable to detect DualShock 4
Product: Wine
Version: 2.11
Hardware: x86-64
OS: Linux
Status: UNCONFIRMED
Severity: normal
Priority: P2
Component: hid
Assignee: wine-bugs(a)winehq.org
Reporter: haakobja(a)gmail.com
Distribution: ---
Created attachment 58651
--> https://bugs.winehq.org/attachment.cgi?id=58651
LEGO Harry Potter: Years 1-4 with Dualsock 4
I have a Dualshock 4 controller (Model: cuh-zct2e) and this is not detected at
all in Lego Harry Potter: Years 1-4. The game uses dinput8.
My Dualshock 3 is detected as expected. I guess there is a mapping issue.
I've attached a log.
--
Do not reply to this email, post in Bugzilla using the
above URL to reply.
You are receiving this mail because:
You are watching all bug changes.
https://bugs.winehq.org/show_bug.cgi?id=39498
Bug ID: 39498
Summary: LEGO Rock Raiders - Using bundled d3drm.dll causes
freezing
Product: Wine
Version: 1.7.50
Hardware: x86-64
OS: Linux
Status: UNCONFIRMED
Severity: normal
Priority: P2
Component: directx-d3d
Assignee: wine-bugs(a)winehq.org
Reporter: david.maza.au(a)gmail.com
Distribution: ---
Created attachment 52637
--> https://bugs.winehq.org/attachment.cgi?id=52637
Compressed Trace Log
Hello,
If I use the bundled d3drm.dll version to play Lego Rock Raiders, the game
freezes after the first screen.
The music continues to play in the background but the game is unplayable.
Interestingly, holding down a key on my keyboard stops the freezing. For
example, holding down the Alt+Tab key combination causes the game to continue
rendering items on the screen.
Unfortunately using the native d3drm.dll doesn't work and causes a crash on
startup (bug #39497).
--
Do not reply to this email, post in Bugzilla using the
above URL to reply.
You are receiving this mail because:
You are watching all bug changes.
http://bugs.winehq.org/show_bug.cgi?id=31072
Bug #: 31072
Summary: Diablo III: Sound is very quiet
Product: Wine
Version: 1.5.7
Platform: x86-64
OS/Version: Linux
Status: UNCONFIRMED
Severity: normal
Priority: P2
Component: -unknown
AssignedTo: wine-bugs(a)winehq.org
ReportedBy: sworddragon2(a)aol.com
Classification: Unclassified
If some NPC's are talking for example if I'm finding a book with a story I have
troubles to understand them because the voices are very quiet. I have already
set all ingame sound to 100% and have still to need to turn up much my sound
boxes. Only the cinematics have a loud (normal) sound.
--
Configure bugmail: http://bugs.winehq.org/userprefs.cgi?tab=email
Do not reply to this email, post in Bugzilla using the
above URL to reply.
------- You are receiving this mail because: -------
You are watching all bug changes.
https://bugs.winehq.org/show_bug.cgi?id=49657
Bug ID: 49657
Summary: SCP: Secret Laboratory no longer works after an update
Product: Wine
Version: 5.14
Hardware: x86-64
OS: Linux
Status: UNCONFIRMED
Severity: normal
Priority: P2
Component: -unknown
Assignee: wine-bugs(a)winehq.org
Reporter: flgx(a)protonmail.com
Distribution: ---
SCP: Secret Laboratory
(https://store.steampowered.com/app/700330/SCP_Secret_Laboratory) no longer
works after a big update called "scopophobia", which includes an anti-cheat.
The game just does not start and seems to be stuck doing something with
registry.
The game worked even with the update as beta branch testing, but I assume the
anti-cheat wasn't there yet.
It looks like it's doing some virtual machine checks and checks
SystemBiosVersion and VideoBiosVersion, which wine doesn't have as far I know.
It also seems to do something with ControlSet001 which is also not in wine as
far I know.
I also tried creating the registry keys and values manually with no success.
(while wineserver was still running)
This issue might be similiar to the PUBG: Lite one #47701 which also seems to
check SystemBiosVersion.
Would it be possible to add SystemBiosVersion, VideoBiosVersion registry values
to wine?
And about ControlSet001, would it make sense to link it to the
CurrentControlSet in case it is actually required by the game?
--
Do not reply to this email, post in Bugzilla using the
above URL to reply.
You are receiving this mail because:
You are watching all bug changes.
https://bugs.winehq.org/show_bug.cgi?id=39072
Bug ID: 39072
Summary: Olympus Viewer crashes when it tries to process ORF
files
Product: Wine
Version: unspecified
Hardware: x86
OS: Linux
Status: UNCONFIRMED
Severity: normal
Priority: P2
Component: ntdll
Assignee: wine-bugs(a)winehq.org
Reporter: samkochkarev(a)gmail.com
Distribution: ---
Created attachment 52056
--> https://bugs.winehq.org/attachment.cgi?id=52056
backtrace
Both issues are related - you can either start Export or just press the
triangle to start raw processing.
--
Do not reply to this email, post in Bugzilla using the
above URL to reply.
You are receiving this mail because:
You are watching all bug changes.
https://bugs.winehq.org/show_bug.cgi?id=46509
Bug ID: 46509
Summary: WinOmega client editor causes Access violation in
module ntdll.dll
Product: Wine
Version: 4.0-rc7
Hardware: x86
OS: Linux
Status: UNCONFIRMED
Severity: normal
Priority: P2
Component: comctl32
Assignee: wine-bugs(a)winehq.org
Reporter: development(a)winomega.com
Distribution: ---
Created attachment 63359
--> https://bugs.winehq.org/attachment.cgi?id=63359
access violation error
Starting with c9e98034b37f44d505ba406f94031d02e226a176, an Access violation is
caused when trying to access the client editor in WinOmega.
(the client editor is a window that includes some ComboBox objects, and it
appears that one of them is propagating the exception)
See attachment for the error message.
--
Do not reply to this email, post in Bugzilla using the
above URL to reply.
You are receiving this mail because:
You are watching all bug changes.
https://bugs.winehq.org/show_bug.cgi?id=46209
Bug ID: 46209
Summary: TB_GETBUTTONINFO does not return toolbar text
Product: Wine
Version: 3.21
Hardware: x86
OS: Linux
Status: UNCONFIRMED
Severity: normal
Priority: P2
Component: comctl32
Assignee: wine-bugs(a)winehq.org
Reporter: nikolaysemenkov(a)gmail.com
Distribution: ---
Hi,
Wine failed to return the toolbar text, even if just successfully add it, then
next attempt to get it in a row also failed.
Code:
TBBUTTON tbb;
tbb.idCommand = 123;
tbb.iBitmap = I_IMAGENONE;
tbb.fsState = TBSTATE_ENABLED;
tbb.fsStyle = BTNS_BUTTON;
tbb.dwData = 0;
tbb.iString = int(SendMessage(hwndToolBar, TB_ADDSTRING, 0,
LPARAM(TEXT("TEXT2TEST"))));
SendMessage(hwndToolBar, TB_ADDBUTTONS, 1, LPARAM(&tbb));
int nItem = 0;
tchar szLabel[LSTR];
TBBUTTONINFO tbbi;
tbbi.cbSize = sizeof(TBBUTTONINFO);
tbbi.dwMask = TBIF_BYINDEX | TBIF_TEXT;
tbbi.pszText = szLabel;
tbbi.cchText = LSTR;
SendMessage(hwndToolBar, TB_GETBUTTONINFO, WPARAM(nItem), LPARAM(&tbbi));
tbbi.pszText is empty on wine, but works on windows.
Nik
--
Do not reply to this email, post in Bugzilla using the
above URL to reply.
You are receiving this mail because:
You are watching all bug changes.
https://bugs.winehq.org/show_bug.cgi?id=40321
Bug ID: 40321
Summary: Install of Huion H610Pro Drawing Tablet fails ...
Product: Wine
Version: unspecified
Hardware: x86
OS: Linux
Status: UNCONFIRMED
Severity: normal
Priority: P2
Component: -unknown
Assignee: wine-bugs(a)winehq.org
Reporter: dave_m16(a)hotmail.com
Distribution: ---
Created attachment 53973
--> https://bugs.winehq.org/attachment.cgi?id=53973
the show details on serious error
Serious error --- details attached --- thanks
--
Do not reply to this email, post in Bugzilla using the
above URL to reply.
You are receiving this mail because:
You are watching all bug changes.
https://bugs.winehq.org/show_bug.cgi?id=37227
Bug ID: 37227
Summary: Button clicks are ignored in the application
Product: Wine
Version: 1.7.25
Hardware: x86
OS: Linux
Status: UNCONFIRMED
Severity: normal
Priority: P2
Component: -unknown
Assignee: wine-bugs(a)winehq.org
Reporter: dick.kniep(a)lindix.nl
We are using Go-Global for UNIX v2.2.19 to connect to our servers.
(Download from
ftp://ftp.graphon.com/pub/GO-Global-UX/v2.2.19/go_setup_2.2.19.1222.exe)
This used to work pretty good with wine in the past. But with wine 1.7.25, as
soon as a graphical program is started, any mouseclick in the screen is
ignored, rendering the application useless.
You can use one of our servers to verify.
Steps to reproduce:
1. install under wine: works OK
2. choose secure socket as transport
3. connect to demo.cvix.nl
4. login using winetest/winetest as credentials
Then you will get a window with a firefox icon.
You can type in the bar and will get a website. Try a website where a
buttonclick is required and you will notice that this will not work. It simply
ignores the click event.
BTW. There is another problem with the keyboard. We are using a US-intl
keyboard, but it insists in using a Dutch keyboard where the keys are mapped to
different locations.
--
Do not reply to this email, post in Bugzilla using the
above URL to reply.
You are receiving this mail because:
You are watching all bug changes.
https://bugs.winehq.org/show_bug.cgi?id=41691
Bug ID: 41691
Summary: I am trying to run The Political Machine 2016 on steam
and I am presented with the "this program has
encounted a serious problem and needs to close"
message.
Product: Wine
Version: 1.9.21
Hardware: x86
OS: Mac OS X
Status: UNCONFIRMED
Severity: normal
Priority: P2
Component: -unknown
Assignee: wine-bugs(a)winehq.org
Reporter: 99timb(a)gmail.com
Created attachment 56089
--> https://bugs.winehq.org/attachment.cgi?id=56089
The log error report
I am trying to play The Political Machine 2016 on steam with wine and this is
happening. I'm new so I don't know what to do.
--
Do not reply to this email, post in Bugzilla using the
above URL to reply.
You are receiving this mail because:
You are watching all bug changes.
https://bugs.winehq.org/show_bug.cgi?id=41393
Bug ID: 41393
Summary: Unable to use CTRL-V shortcut to paste in some
applications
Product: Wine
Version: 1.9.19
Hardware: x86-64
OS: Linux
Status: UNCONFIRMED
Severity: normal
Priority: P2
Component: -unknown
Assignee: wine-bugs(a)winehq.org
Reporter: michelesr(a)autistici.org
Distribution: ---
This bug is not present in 1.9.18 and older versions of Wine.
How to reproduce: open the application, then try to press CTRL-V key, nothing
happens.
Verified in "World of Warcraft" and "Warcraft III" games.
OS: Arch Linux, Linux 4.7.4-1 x86_64
--
Do not reply to this email, post in Bugzilla using the
above URL to reply.
You are receiving this mail because:
You are watching all bug changes.
http://bugs.winehq.org/show_bug.cgi?id=36708
Bug ID: 36708
Summary: Crash during attempt to load SecureDownloadManager.exe
Product: Wine
Version: 1.6.2
Hardware: x86
OS: Linux
Status: UNCONFIRMED
Severity: normal
Priority: P2
Component: -unknown
Assignee: wine-bugs(a)winehq.org
Reporter: fyejm5(a)gmail.com
Created attachment 48753
--> http://bugs.winehq.org/attachment.cgi?id=48753
Unhandled exception: page fault on read access to 0x00710033 in 32-bit code
Successfully installed a .MSI file for a secure downloader specific to licensed
Windows-related software. When attempting to initiate the .exe for the
downloader and load the .SDX file (URL to location of software), Wine crashed
with the attached dump.
--
Do not reply to this email, post in Bugzilla using the
above URL to reply.
You are receiving this mail because:
You are watching all bug changes.
https://bugs.winehq.org/show_bug.cgi?id=40449
Bug ID: 40449
Summary: Join.me fails to start
Product: Wine
Version: 1.9.7
Hardware: x86-64
OS: Linux
Status: UNCONFIRMED
Severity: normal
Priority: P2
Component: -unknown
Assignee: wine-bugs(a)winehq.org
Reporter: kamijoutouma648(a)gmail.com
Distribution: ---
WINEPREFIX=~/.wine/join.me wine ~/Downloads/join.me.exe
err:ntdll:NtQueryInformationToken Unhandled Token Information class 29!
fixme:msvcrt:__clean_type_info_names_internal (0x1000a888) stub
When trying to launch join.me after installing directx9
--
Do not reply to this email, post in Bugzilla using the
above URL to reply.
You are receiving this mail because:
You are watching all bug changes.
http://bugs.winehq.org/show_bug.cgi?id=29445
Bug #: 29445
Summary: LearningCenter.exe fail to start with mono28 but works
with native .net
Product: Wine
Version: 1.3.35
Platform: x86
OS/Version: Linux
Status: UNCONFIRMED
Severity: normal
Priority: P2
Component: mscoree
AssignedTo: wine-bugs(a)winehq.org
ReportedBy: fracting(a)gmail.com
Classification: Unclassified
1. Download from http://cetd.sysu.edu.cn/class/NPELSPluginSetup.rar
2. unrar NPELSPluginSetup.rar
3. winetricks -q mono210
4. install setup_v1.1.0.103(101217).exe
5. start LearningCenter.exe
$ cd "~/.wine/drive_c/Program Files/SFLEP/NPELS_LearningCenter_5.0"
$ wine LearningCenter.exe
The application could not start at all, but with native .net2.0 it can start.
Will attach full logs.
--
Configure bugmail: http://bugs.winehq.org/userprefs.cgi?tab=email
Do not reply to this email, post in Bugzilla using the
above URL to reply.
------- You are receiving this mail because: -------
You are watching all bug changes.
http://bugs.winehq.org/show_bug.cgi?id=16577
Summary: ntdll/loader/actctx: add support of SxS assembly binding
redirects
Product: Wine
Version: 1.1.10
Platform: All
URL: http://nikonusa.com/software/NX/1.3/win/CNX130NSAEN.EXE
OS/Version: Linux
Status: UNCONFIRMED
Severity: normal
Priority: P2
Component: ntdll
AssignedTo: wine-bugs(a)winehq.org
ReportedBy: focht(a)gmx.net
Hello,
this is a showcase bug.
I used the app from bug 12414 as example because it highlights some of the
issues and hopefully helps to understand the problem (with my comments).
We need to end this winetricks vcrun2XXX SxS mess/hell, which requires direct
match of SxS assembly dependencies/bindings.
Download: http://nikonusa.com/software/NX/1.3/win/CNX130NSAEN.EXE
$ sha1sum CNX130NSAEN.EXE -> f31b38e3bcca17c8050c207b79315c9be23d582d
Prerequisite: clean WINEPREFIX, winetricks dotnet20
---
The first installer show stopper (which is this bug report out) are actually
two bugs: one in winetricks and one in the installer.
When you did 'sh winetricks dotnet20' step and start the installer, an error
message box will be shown shortly thereafter:
--- snip ---
Microsoft Visual C++ Runtime Library
Program: c:\windows\temp\RarSFX0\cnx.exe
R6034
An application has made an attempt to load the C runtime library incorrectly.
--- snip ---
The problem comes in form of a sub-installer dependency:
WINEDEBUG=+tid,+seh,+loaddll,+process wine ./nikon.exe
--- snip ---
...
0079:trace:process:CreateProcessW app (null) cmdline
L"C:\\windows\\temp\\RarSFX0\\cnx.exe"
...
0079:trace:process:CreateProcessW started process pid 007a tid 007b
...
007b:trace:loaddll:free_modref Unloaded module
L"C:\\windows\\temp\\nshbb9d.tmp\\UserInfo.dll" : native
007b:trace:loaddll:load_native_dll Loaded
L"C:\\windows\\temp\\nshbb9d.tmp\\process.dll" at 0x10000000: native
007b:fixme:actctx:parse_depend_manifests Could not find dependent assembly
L"Microsoft.VC80.CRT"
007b:trace:loaddll:load_native_dll Loaded
L"C:\\windows\\temp\\nshbb9d.tmp\\LIBEXPATW.dll" at 0x3d0000: native
007b:trace:loaddll:load_builtin_dll Loaded L"C:\\windows\\system32\\mpr.dll" at
0x60c50000: builtin
007b:trace:loaddll:load_builtin_dll Loaded
L"C:\\windows\\system32\\wininet.dll" at 0x60c00000: builtin
007b:trace:loaddll:load_builtin_dll Loaded L"C:\\windows\\system32\\msvcrt.dll"
at 0x60c80000: builtin
007b:trace:loaddll:load_native_dll Loaded L"C:\\windows\\system32\\MSVCR80.dll"
at 0x78130000: native
007b:trace:loaddll:load_native_dll Loaded L"C:\\windows\\system32\\MSVCP80.dll"
at 0x7c420000: native
007b:trace:loaddll:load_native_dll Loaded
L"C:\\windows\\temp\\nshbb9d.tmp\\Activation.dll" at 0x3a0000: native
--- snip ---
The culprit is: "fixme:actctx:parse_depend_manifests Could not find dependent
assembly L"Microsoft.VC80.CRT"
If we dump the embedded manifest from PE for the "Activation.dll":
--- snip ---
<assembly xmlns="urn:schemas-microsoft-com:asm.v1" manifestVersion="1.0">
<dependency>
<dependentAssembly>
<assemblyIdentity type="win32" name="Microsoft.VC80.CRT"
version="8.0.50727.762" processorArchitecture="x86"
publicKeyToken="1fc8b3b9a1e18e3b"></assemblyIdentity>
</dependentAssembly>
</dependency>
<dependency>
<dependentAssembly>
<assemblyIdentity type="win32" name="Microsoft.VC80.CRT"
version="8.0.50608.0" processorArchitecture="x86"
publicKeyToken="1fc8b3b9a1e18e3b">
</assemblyIdentity>
--- snip ---
We can see two VC 8.0 runtime versions referenced, the VC 8.0 SP1 and an older
VC 8.0 one.
"8.0.50727.762" -> Visual C++ 2005 SP1 Redistributable Pack 8.0.50727.762
At this stage, only .NET Framwork 2.0 redist got installed as prerequisite in
WINEPREFIX.
Because of winetricks' winver 2k hack (missing junction point workaround, bug
12401), VC 8.0.50727.42 runtimes are placed in both: system32 and SxS repo.
This results in errorneous behaviour in case of SxS assembly resolver failure
(app references 8.x CRT assemblies not found in SxS) - a fallback load from
system32 - which causes the CRT error.
I already explained the differences between 2K and XP in several other bug
reports when it comes to loading of SxS assemblies.
In short: prevent any CRT (and ATL/MFC) 8.x+ runtime from being put into
system32!
Such assemblies are never to be loaded from system32 with winver > 2K!
To fix this, 'winetricks dotnet20' step needs to include the removal of these
assemblies from system32 as cleanup procedure.
A second copy is properly installed into SxS as precaution from M$ guys in the
light of win2k -> winxp update which knows about activation contexts/SxS.
--- snip .wine/drive_c/windows/system32 ---
$ ls -lsa msvc*
472 -rw-rw-r-- 1 focht focht 479232 2005-09-23 08:29 msvcm80.dll
540 -rw-rw-r-- 1 focht focht 548864 2005-09-23 08:29 msvcp80.dll
616 -rw-rw-r-- 1 focht focht 626688 2005-09-23 08:29 msvcr80.dll
..
--- snip .wine/drive_c/windows/system32 ---
The vendor msi installer bug at this stage is that the sub-installer is
executed *before* the VC redist installer which would install all required CRT
dependencies into SxS.
Hence this error is only shown once.
That sub-installer failure seems not critical.
Now one might think: "ok, lets do the usual winetricks vcrun2005 ...
vcrun2005sp1 mess" before install.
If you do this, the error will still remain (assuming you restart with clean
WINEPREFIX).
The reason is the other "old" VC 8.0 CRT version, referenced in dll manifest:
8.0.50608.0
Winetricks dotnet20 installed a VC 8.0.50727.42 CRT version into SxS (after we
removed the ones from system32).
This would ideally work but Wine's loader doesn't support the redirection of
assembly bindings yet.
If you take a look at the policy file from .NET 2.0 installed VC 8 runtime:
"c:\windows\winSxS\policies\x86_policy.8.0.Microsoft.VC80.CRT_1fc8b3b9a1e18e3b_x-ww_77c24773\":
--- snip 8.0.50727.42.policy ---
<bindingRedirect oldVersion="8.0.41204.256-8.0.50608.0"
newVersion="8.0.50727.42"/>
--- snip 8.0.50727.42.policy ---
The policy rule would be satisfied, because the assembly asks for version
8.0.50608.0 and the current "up-to-date" version 8.0.50727.42 can be used for
that.
After VC 8.0 SP1 install (sh winetricks vcrun2005sp1), another policy file is
added:
--- snip 8.0.50727.762.policy ---
<bindingRedirect oldVersion="8.0.41204.256-8.0.50608.0"
newVersion="8.0.50727.762"/>
<bindingRedirect oldVersion="8.0.50727.42-8.0.50727.762"
newVersion="8.0.50727.762"/>
--- snip 8.0.50727.762.policy ---
This would cover (match) the first assembly binding dependency, 8.0.50727.762
Regards
--
Configure bugmail: http://bugs.winehq.org/userprefs.cgi?tab=email
Do not reply to this email, post in Bugzilla using the
above URL to reply.
------- You are receiving this mail because: -------
You are watching all bug changes.
https://bugs.winehq.org/show_bug.cgi?id=44841
Bug ID: 44841
Summary: GTA 5 rendering issue (green screen/textures) on
NVidia 9800GT
Product: Wine
Version: 3.4
Hardware: x86-64
OS: Linux
Status: UNCONFIRMED
Severity: normal
Priority: P2
Component: -unknown
Assignee: wine-bugs(a)winehq.org
Reporter: o.dierick(a)piezo-forte.be
Distribution: ---
Created attachment 60887
--> https://bugs.winehq.org/attachment.cgi?id=60887
default terminal output (wine-staging 3.4)
The intro video is all black with sound.
The start menu is all green with GTAV logo in corner.
In-game is green/black mix of polygons/surfaces.
Music, sound, GTA V logo in menu and Player connection pop-ups and social club
window are fine. Can hear gunfire when hitting the fire button.
So basically the game runs but the video rendering is broken.
64bit prefix with Wine-staging 3.4
NVidia 9800GT (1GB VRAM) with Debian-provided NVidia 340.102 proprietary
driver.
Happens both in full-screen(1920x1080) and windowed mode(800x600).
Happens in DX10, DX10.1 and DX11 modes (changed in the game settings file).
With wine 2.12, the intro and menu were fine but the in-game was all messed-up
flickering and stretching gray/black polygons with the player being a static
black silhouette.
Game runs fine with NVidia GTX970.
--
Do not reply to this email, post in Bugzilla using the
above URL to reply.
You are receiving this mail because:
You are watching all bug changes.
https://bugs.winehq.org/show_bug.cgi?id=38551
Bug ID: 38551
Summary: cl.exe hangs but succeeds on relaunch
Product: Wine
Version: 1.7.42
Hardware: x86-64
OS: Linux
Status: UNCONFIRMED
Severity: normal
Priority: P2
Component: -unknown
Assignee: wine-bugs(a)winehq.org
Reporter: xantares09(a)hotmail.com
Distribution: ---
Created attachment 51424
--> https://bugs.winehq.org/attachment.cgi?id=51424
build script output
i'm trying to use microsoft compiler into wine and it hangs compiling a simple
hello world
if i hit ctrl+c in the console and relaunch my build script it succeeds (seems
once the wineserver process it started next builds will succeed. if i kill
wineserver it will fail once more.
I'm using latest wine 1.7.42 on archlinux x86_64 and vc2010express+cmake from
winetricks
i use these install/build scripts for you to reproduce the problem:
https://github.com/xantares/msvc-wine
i get these repeated timeout messages later:
err:ntdll:RtlpWaitForCriticalSection, see build.log
--
Do not reply to this email, post in Bugzilla using the
above URL to reply.
You are receiving this mail because:
You are watching all bug changes.
http://bugs.winehq.org/show_bug.cgi?id=35220
Bug ID: 35220
Summary: Clickr: puzzle table is hidden behind solid color with
built-in d3dx libraries
Product: Wine
Version: 1.7.9
Hardware: x86
OS: Linux
Status: NEW
Severity: minor
Priority: P2
Component: directx-d3dx9
Assignee: wine-bugs(a)winehq.org
Reporter: gyebro69(a)gmail.com
CC: wine-bugs(a)winehq.org
Classification: Unclassified
Created attachment 46970
--> http://bugs.winehq.org/attachment.cgi?id=46970
terminal output
'Clickr' is a puzzle game, the Steam version comes bundled with native
d3dx9_34.dll.
If I use Wine's built-in d3dx9* dlls the puzzle table is covered by some pink
color.
Either native d3dx9_34 or d3dx9_36 works around the problem and the table is
displayed correctly.
Fedora 19
Nvidia binary drivers 325.15
--
Do not reply to this email, post in Bugzilla using the
above URL to reply.
You are receiving this mail because:
You are watching all bug changes.
http://bugs.winehq.org/show_bug.cgi?id=33080
Bug #: 33080
Summary: While running DPFMate.exe, Unhandled exception: page
fault on read access to 0x00000004 in 32-bit code
(0x0040ea53).
Product: Wine
Version: 1.5.24
Platform: x86
OS/Version: Linux
Status: UNCONFIRMED
Severity: normal
Priority: P2
Component: -unknown
AssignedTo: wine-bugs(a)winehq.org
ReportedBy: jon(a)sprig.gs
Classification: Unclassified
Created attachment 43734
--> http://bugs.winehq.org/attachment.cgi?id=43734
Backtrace
Please see attached backtrace. This is a simple keyring photoframe manager.
Wine is using Ubuntu 12.04, plus the Wine PPA, latest winetricks downloaded
from the SVN (WINETRICKS_VERSION=20120912) to install MFC42U.dll.
After I got similar results to the backtrace, I tried forcing the app to use
the Win2k emulation mode, and then captured this backtrace - probably not the
best idea, but I'm happy to run any other diagnostics.
--
Configure bugmail: http://bugs.winehq.org/userprefs.cgi?tab=email
Do not reply to this email, post in Bugzilla using the
above URL to reply.
------- You are receiving this mail because: -------
You are watching all bug changes.
http://bugs.winehq.org/show_bug.cgi?id=31839
Bug #: 31839
Summary: Mouse jumps to the upper left corner of the screen
Product: Wine
Version: 1.5.14
Platform: x86-64
OS/Version: Linux
Status: UNCONFIRMED
Severity: normal
Priority: P2
Component: -unknown
AssignedTo: wine-bugs(a)winehq.org
ReportedBy: sworddragon2(a)aol.com
Classification: Unclassified
On some games (I noticed this only on Blizzard games) the mouse position is set
on starting/exiting the game to the upper left corner of the screen. Just a few
examples:
- On Diablo 3 this works on starting and exiting the game (independent if
-opengl is used or not).
- On Warcraft 3 (RoC and TFT) this works only on starting the game and if
-opengl is used.
--
Configure bugmail: http://bugs.winehq.org/userprefs.cgi?tab=email
Do not reply to this email, post in Bugzilla using the
above URL to reply.
------- You are receiving this mail because: -------
You are watching all bug changes.
https://bugs.winehq.org/show_bug.cgi?id=43816
Bug ID: 43816
Summary: The Witcher 3: white outline on vegetation during rain
at nighttime
Product: Wine
Version: 2.18
Hardware: x86-64
OS: Linux
Status: UNCONFIRMED
Severity: normal
Priority: P2
Component: directx-d3d
Assignee: wine-bugs(a)winehq.org
Reporter: shtetldik(a)gmail.com
Distribution: ---
Created attachment 59363
--> https://bugs.winehq.org/attachment.cgi?id=59363
White outline on vegetation during rain at nighttime
When it's raining and it's dark, some vegetation gets a white outline, which is
probably supposed to represent some wet texture. It looks incorrect. See
attached screenshot.
Configuration:
Graphics:
OpenGL renderer string: AMD Radeon (TM) RX 480 Graphics (POLARIS10 / DRM 3.15.0
/ 4.12.0-2-amd64, LLVM 5.0.0)
OpenGL core profile version string: 4.5 (Core Profile) Mesa 17.3.0-devel
(git-4b41361894)
(+Mesa freeze prevention patch).
Wine staging patches applied:
wined3d-buffer_create wined3d-sample_c_lz wined3d-GenerateMips
d3d11-Deferred_Context xaudio2-get_al_format
--
Do not reply to this email, post in Bugzilla using the
above URL to reply.
You are receiving this mail because:
You are watching all bug changes.
https://bugs.winehq.org/show_bug.cgi?id=40338
Bug ID: 40338
Summary: XenCenter 6.5 doesn't start
Product: Wine
Version: 1.9.5
Hardware: x86-64
OS: Linux
Status: UNCONFIRMED
Severity: normal
Priority: P2
Component: -unknown
Assignee: wine-bugs(a)winehq.org
Reporter: blauerhunger(a)outlook.de
Distribution: Ubuntu
Created attachment 54009
--> https://bugs.winehq.org/attachment.cgi?id=54009
The logfile XenCenter creates in
/home/user/.wine/drive_c/users/user/Application
Data/Citrix/XenCenter/logs/XenCenter.log
When trying to start XenCenter 6.5, it shows an error message "There has been
an unexpected error. Technical details about this error have been saved to the
following file. Please send this to your support representative."
On Windows (at least 7, 8.1 and 10), it works without any problems.
--
Do not reply to this email, post in Bugzilla using the
above URL to reply.
You are receiving this mail because:
You are watching all bug changes.
http://bugs.winehq.org/show_bug.cgi?id=32760
Bug #: 32760
Summary: Mono not running VB.NET app
Product: Wine
Version: 1.5.22
Platform: x86
OS/Version: Linux
Status: UNCONFIRMED
Severity: normal
Priority: P2
Component: -unknown
AssignedTo: wine-bugs(a)winehq.org
ReportedBy: pwthomas95(a)satx.rr.com
Classification: Unclassified
I tried running the VB.Net app on 1.5.19 with exact same results. When run from
the command line it produces a massive, console over flowing error log. I had a
forum thread so I have the log on pastebin: http://pastebin.com/kh9CLcqM
--
Configure bugmail: http://bugs.winehq.org/userprefs.cgi?tab=email
Do not reply to this email, post in Bugzilla using the
above URL to reply.
------- You are receiving this mail because: -------
You are watching all bug changes.
https://bugs.winehq.org/show_bug.cgi?id=40339
Bug ID: 40339
Summary: wine does not detect java
Product: Wine
Version: unspecified
Hardware: x86
OS: Linux
Status: UNCONFIRMED
Severity: normal
Priority: P2
Component: -unknown
Assignee: wine-bugs(a)winehq.org
Reporter: boblebarbare2(a)gmail.com
Distribution: ---
Created attachment 54013
--> https://bugs.winehq.org/attachment.cgi?id=54013
minecraft
wine does not detect java by minecraft and write launch4j error
--
Do not reply to this email, post in Bugzilla using the
above URL to reply.
You are receiving this mail because:
You are watching all bug changes.
https://bugs.winehq.org/show_bug.cgi?id=39725
Bug ID: 39725
Summary: Strat-o-matic baseball (v. 2015g)will not open. The
pop up mearly states "the program SOMBB.exe has
encountered a serious problem and needs to close."
Product: Wine
Version: 1.7.53
Hardware: x86
OS: Mac OS X
Status: UNCONFIRMED
Severity: normal
Priority: P2
Component: -unknown
Assignee: wine-bugs(a)winehq.org
Reporter: jdpwinters(a)gmail.com
Created attachment 52981
--> https://bugs.winehq.org/attachment.cgi?id=52981
Attached is the report "program error details."
SOM baseball is a baseball simulator using previous stats to recreate player
performance. Commerical software, company website :
http://www.strat-o-matic.com; no free version available.
--
Do not reply to this email, post in Bugzilla using the
above URL to reply.
You are receiving this mail because:
You are watching all bug changes.
https://bugs.winehq.org/show_bug.cgi?id=38605
Bug ID: 38605
Summary: Games stopped working after upgrading from Wine 1.4 to
1.6/1.7
Product: Wine
Version: 1.7.38
Hardware: x86-64
OS: Linux
Status: UNCONFIRMED
Severity: normal
Priority: P2
Component: -unknown
Assignee: wine-bugs(a)winehq.org
Reporter: kbon(a)gmx.com
Distribution: ---
Created attachment 51500
--> https://bugs.winehq.org/attachment.cgi?id=51500
Backtrace log
Hi, I just recently upgraded my install of Linux Mint Debian Edition from
version 1 to v2, which made Wine upgrade from 1.4x to 1.6 (the latest found on
debian jessie repos), and with it several games (Age of Empires 2, Herts of
Iron 2) which did run flawlessly before the upgrade stopped working altogether.
The error I get on the command line is:
wine: Unhandled page fault on read access to 0x00000000 at address 0x7dc3a0f0
(thread 0009), starting debugger...
I tried recreating the wine prefix, running it with a 32-bit prefix, and
upgrading to wine 1.7 following this guide:
http://forums.linuxmint.com/viewtopic.php?f=238&t=193804
Attached is the backtrace of the error.
My OS: LMDE 2 (Debian 8 )
Kernel: 3.16.0-4-amd64 #1 SMP Debian 3.16.7-ckt9-3~deb8u1 (2015-04-24) x86_64
GNU/Linux
Video / Driver: [AMD/ATI] Trinity [Radeon HD 7480D] using latest propietary
drivers (fglrx-14.501.1003)
--
Do not reply to this email, post in Bugzilla using the
above URL to reply.
You are receiving this mail because:
You are watching all bug changes.
http://bugs.winehq.org/show_bug.cgi?id=30376
Bug #: 30376
Summary: Baldurs Gate II (GOG.com version) crashes on loading
specific save games
Product: Wine
Version: 1.5.1
Platform: x86
OS/Version: Mac OS X
Status: UNCONFIRMED
Severity: normal
Priority: P2
Component: -unknown
AssignedTo: wine-bugs(a)winehq.org
ReportedBy: jpranevich(a)gmail.com
Classification: Unclassified
Created attachment 39718
--> http://bugs.winehq.org/attachment.cgi?id=39718
Crash info
Baldurs Gate II (GOG.com version) crashes on loading specific save games from
certain areas of the game, especially Chapter 7. The identical save games work
on Windows install.
--
Configure bugmail: http://bugs.winehq.org/userprefs.cgi?tab=email
Do not reply to this email, post in Bugzilla using the
above URL to reply.
------- You are receiving this mail because: -------
You are watching all bug changes.
https://bugs.winehq.org/show_bug.cgi?id=42065
Bug ID: 42065
Summary: WOW 7.1 spams fixme:d3d_draw:draw_primitive_arrays
Start instance (VALUE) not supported.
Product: Wine
Version: 2.0-rc3
Hardware: x86
OS: Linux
Status: UNCONFIRMED
Severity: enhancement
Priority: P2
Component: -unknown
Assignee: wine-bugs(a)winehq.org
Reporter: winetest(a)luukku.com
Distribution: ---
The spam comes from here
http://source.winehq.org/git/wine.git/blob/80d2edd5845c09b98cb5b6b7779b4455…
and the function gets different values as shown here as example.
fixme:d3d_draw:draw_primitive_arrays Start instance (23883) not supported.
fixme:d3d_draw:draw_primitive_arrays Start instance (23887) not supported.
fixme:d3d_draw:draw_primitive_arrays Start instance (23889) not supported.
fixme:d3d_draw:draw_primitive_arrays Start instance (23893) not supported.
fixme:d3d_draw:draw_primitive_arrays Start instance (23895) not supported.
fixme:d3d_draw:draw_primitive_arrays Start instance (23899) not supported.
fixme:d3d_draw:draw_primitive_arrays Start instance (23901) not supported.
fixme:d3d_draw:draw_primitive_arrays Start instance (23905) not supported.
fixme:d3d_draw:draw_primitive_arrays Start instance (23907) not supported.
fixme:d3d_draw:draw_primitive_arrays Start instance (78301) not supported.
fixme:d3d_draw:draw_primitive_arrays Start instance (78305) not supported.
fixme:d3d_draw:draw_primitive_arrays Start instance (78309) not supported.
fixme:d3d_draw:draw_primitive_arrays Start instance (78313) not supported.
fixme:d3d_draw:draw_primitive_arrays Start instance (78317) not supported.
fixme:d3d_draw:draw_primitive_arrays Start instance (78319) not supported.
fixme:d3d_draw:draw_primitive_arrays Start instance (78323) not supported.
fixme:d3d_draw:draw_primitive_arrays Start instance (78325) not supported.
fixme:d3d_draw:draw_primitive_arrays Start instance (78329) not supported.
fixme:d3d_draw:draw_primitive_arrays Start instance (78331) not supported.
fixme:d3d_draw:draw_primitive_arrays Start instance (78335) not supported.
fixme:d3d_draw:draw_primitive_arrays Start instance (78337) not supported.
fixme:d3d_draw:draw_primitive_arrays Start instance (89136) not supported.
fixme:d3d_draw:draw_primitive_arrays Start instance (89140) not supported.
fixme:d3d_draw:draw_primitive_arrays Start instance (89144) not supported.
fixme:d3d_draw:draw_primitive_arrays Start instance (89148) not supported.
fixme:d3d_draw:draw_primitive_arrays Start instance (89152) not supported.
fixme:d3d_draw:draw_primitive_arrays Start instance (89154) not supported.
fixme:d3d_draw:draw_primitive_arrays Start instance (89158) not supported.
fixme:d3d_draw:draw_primitive_arrays Start instance (89160) not supported.
fixme:d3d_draw:draw_primitive_arrays Start instance (89164) not supported.
fixme:d3d_draw:draw_primitive_arrays Start instance (89166) not supported.
fixme:d3d_draw:draw_primitive_arrays Start instance (89170) not supported.
fixme:d3d_draw:draw_primitive_arrays Start instance (89172) not supported.
It's just too noicy.
--
Do not reply to this email, post in Bugzilla using the
above URL to reply.
You are receiving this mail because:
You are watching all bug changes.
https://bugs.winehq.org/show_bug.cgi?id=40042
Bug ID: 40042
Summary: Spikit 1.9.4 fails to install
Product: Wine
Version: 1.9.1
Hardware: x86
OS: Linux
Status: UNCONFIRMED
Severity: normal
Priority: P2
Component: -unknown
Assignee: wine-bugs(a)winehq.org
Reporter: lukasz.wojnilowicz(a)gmail.com
Distribution: ---
Created attachment 53496
--> https://bugs.winehq.org/attachment.cgi?id=53496
Error window
Steps to reproduce:
1) remove ~/.wine
2) wine SpikitSetup1.9.4.0.exe
Behaviour:
Error window (see attachment)
Expected behaviour:
No error window.
--
Do not reply to this email, post in Bugzilla using the
above URL to reply.
You are receiving this mail because:
You are watching all bug changes.
http://bugs.winehq.org/show_bug.cgi?id=31933
Bug #: 31933
Summary: GOG.com installer displays the options menu poorly
Product: Wine
Version: 1.5.14
Platform: x86-64
OS/Version: Linux
Status: UNCONFIRMED
Severity: minor
Priority: P2
Component: fonts
AssignedTo: wine-bugs(a)winehq.org
ReportedBy: xvachon(a)gmail.com
Classification: Unclassified
Created attachment 42059
--> http://bugs.winehq.org/attachment.cgi?id=42059
screenshot
Here's an example with the Heroes of Might and Magic 5 Bundle. The console
displays these lines in loop.
fixme:uniscribe:GPOS_apply_lookup We do not handle SubType 5
fixme:uniscribe:GPOS_apply_PairAdjustment Pair Adjustment Positioning: Format 2
Unhandled
I suspect that all the games from GOG have this issue. Marking the issue to
fonts, as I suspect this has to do with a font that Linux does not have.
--
Configure bugmail: http://bugs.winehq.org/userprefs.cgi?tab=email
Do not reply to this email, post in Bugzilla using the
above URL to reply.
------- You are receiving this mail because: -------
You are watching all bug changes.
https://bugs.winehq.org/show_bug.cgi?id=45872
Bug ID: 45872
Summary: Trying to run Destiny 2 in cmd line
Product: Wine
Version: 3.16
Hardware: x86-64
OS: Linux
Status: UNCONFIRMED
Severity: normal
Priority: P2
Component: -unknown
Assignee: wine-bugs(a)winehq.org
Reporter: mfaqiri33(a)gmail.com
Distribution: ---
Created attachment 62377
--> https://bugs.winehq.org/attachment.cgi?id=62377Battle.net launched correctly, Destiny 2 seems to have failed at code 0000014e
I attempted to launch Destiny 2 off the battle.net launcher off of the Lutris
installer for Battle.net. Destiny 2 failed to launch and I received the
backtrace.
--
Do not reply to this email, post in Bugzilla using the
above URL to reply.
You are receiving this mail because:
You are watching all bug changes.
https://bugs.winehq.org/show_bug.cgi?id=38802
Bug ID: 38802
Summary: error when playing a game
Product: Wine
Version: unspecified
Hardware: x86-64
OS: Linux
Status: UNCONFIRMED
Severity: normal
Priority: P2
Component: -unknown
Assignee: wine-bugs(a)winehq.org
Reporter: pdaut01(a)hotmail.com
Distribution: ---
Created attachment 51744
--> https://bugs.winehq.org/attachment.cgi?id=51744
error report from Wine
when I try to play the Pokemon fan game Pokemon Fusion Generation the game
crashes when it asks for my name in that game
--
Do not reply to this email, post in Bugzilla using the
above URL to reply.
You are receiving this mail because:
You are watching all bug changes.
https://bugs.winehq.org/show_bug.cgi?id=38574
Bug ID: 38574
Summary: Heroes of the Storm 64-bit crashes on launch
Product: Wine
Version: 1.7.42
Hardware: x86-64
OS: Linux
Status: NEW
Severity: normal
Priority: P2
Component: -unknown
Assignee: wine-bugs(a)winehq.org
Reporter: adys.wh(a)gmail.com
Distribution: ---
Created attachment 51470
--> https://bugs.winehq.org/attachment.cgi?id=51470
Crash logs
Heroes of the Storm crashes if launching the 64-bit client. Setting it to
32-bit fixes the issue. This has been widely reported outside of Wine.
The game attaches its own debugger so wine's backtraces arent available.
Attached is the game's crash logs including .dmp file.
--
Do not reply to this email, post in Bugzilla using the
above URL to reply.
You are receiving this mail because:
You are watching all bug changes.
https://bugs.winehq.org/show_bug.cgi?id=44572
Bug ID: 44572
Summary: Amazon Workspaces: Crashing while registering
Product: Wine
Version: 1.6.2
Hardware: x86
OS: Linux
Status: UNCONFIRMED
Severity: normal
Priority: P2
Component: -unknown
Assignee: wine-bugs(a)winehq.org
Reporter: menelaosbgr(a)gmail.com
Distribution: ---
Created attachment 60542
--> https://bugs.winehq.org/attachment.cgi?id=60542
The trace from the crash.
I was missing two DLLs that I copied into the C:/windows and
c:/windows/system32 folders. After the application starts.
But when I click the button to login, I get a crash.
Please see attachment.
--
Do not reply to this email, post in Bugzilla using the
above URL to reply.
You are receiving this mail because:
You are watching all bug changes.
https://bugs.winehq.org/show_bug.cgi?id=41244
Bug ID: 41244
Summary: App does not open though other software by same dev
does
Product: Wine
Version: 1.9.17
Hardware: x86
OS: Linux
Status: UNCONFIRMED
Severity: critical
Priority: P2
Component: -unknown
Assignee: wine-bugs(a)winehq.org
Reporter: peter(a)peterkempphotography.com
Distribution: ---
Created attachment 55540
--> https://bugs.winehq.org/attachment.cgi?id=55540
Dump file
Though other Anthropics software eg Portrait Pro Studio run fine new software
will not open.
--
Do not reply to this email, post in Bugzilla using the
above URL to reply.
You are receiving this mail because:
You are watching all bug changes.
https://bugs.winehq.org/show_bug.cgi?id=40543
Bug ID: 40543
Summary: I was trying to run a program and it says that it
can't run it
Product: Wine
Version: unspecified
Hardware: x86
OS: Mac OS X
Status: UNCONFIRMED
Severity: critical
Priority: P2
Component: ntdll
Assignee: wine-bugs(a)winehq.org
Reporter: lihezecava(a)leeching.net
Created attachment 54376
--> https://bugs.winehq.org/attachment.cgi?id=54376
I was trying to run a program and it says that it can't run it
Program can't run
--
Do not reply to this email, post in Bugzilla using the
above URL to reply.
You are receiving this mail because:
You are watching all bug changes.
https://bugs.winehq.org/show_bug.cgi?id=40302
Bug ID: 40302
Summary: I have been using UBUNTU 14.04 desktop and wine source
(1.8.1) .
Product: Wine
Version: 1.8.1
Hardware: x86
OS: Linux
Status: UNCONFIRMED
Severity: major
Priority: P2
Component: wineserver
Assignee: wine-bugs(a)winehq.org
Reporter: himsstory(a)gmail.com
Distribution: ---
Created attachment 53941
--> https://bugs.winehq.org/attachment.cgi?id=53941
Backtrace when I try to open Amazon workspaces using wine.
I got the following error that flex and bison packages are not found. I
installed those packages. Then libxml packages, libxslt packages were also not
installed. however i was able to install wine .
I extracted the .msi installer using msiexexc /i option with wine.The
installation is successful. The login page opens up. When i enter my
credentials, it shows loading and then i get the error. I have tried doing the
same on 64 bit ubuntu 14.0.4 but still the same result.
--
Do not reply to this email, post in Bugzilla using the
above URL to reply.
You are receiving this mail because:
You are watching all bug changes.
https://bugs.winehq.org/show_bug.cgi?id=40621
Bug ID: 40621
Summary: Al cerrar el zara radio muestra un error de
incompatibilidad.
Product: Wine
Version: 1.9.9
Hardware: x86
OS: Linux
Status: UNCONFIRMED
Severity: major
Priority: P2
Component: kernel32
Assignee: wine-bugs(a)winehq.org
Reporter: danielmascaro(a)outlook.com
Distribution: ---
Created attachment 54480
--> https://bugs.winehq.org/attachment.cgi?id=54480
Al cerrar el zara radio muestra un error de incompatibilidad.
Al cerrar el zara radio muestra un error de incompatibilidad.
--
Do not reply to this email, post in Bugzilla using the
above URL to reply.
You are receiving this mail because:
You are watching all bug changes.
http://bugs.winehq.org/show_bug.cgi?id=29434
Bug #: 29434
Summary: Picasa 3.9 fails to authenticate with Google
Product: Wine
Version: 1.3.28
Platform: x86-64
OS/Version: Linux
Status: UNCONFIRMED
Severity: normal
Priority: P2
Component: ntdll
AssignedTo: wine-bugs(a)winehq.org
ReportedBy: mihai(a)mihaic.ro
Classification: Unclassified
Created attachment 38101
--> http://bugs.winehq.org/attachment.cgi?id=38101
Output from running Picasa 3.9 in a terminal.
Picasa 3.9 fails to authenticate with Google. Picasa 3.8 works with the same
setup (Ubuntu 11.10).
The problem is known to Google:
http://www.google.com/support/forum/p/Picasa/thread?tid=1c3f770cc876aeb9&fi…
"[...] we've switched to using OAuth in Picasa 3.9 and our implementation isn't
supported on WINE."
I'm attaching the output I get when running in a terminal (wine Picasa3.exe).
When I try to connect to Google, the following line is output:
"err:ntdll:RtlpWaitForCriticalSection section 0xe10440 "?" wait timed out in
thread 0033, blocked by 0009, retrying (60 sec)"
--
Configure bugmail: http://bugs.winehq.org/userprefs.cgi?tab=email
Do not reply to this email, post in Bugzilla using the
above URL to reply.
------- You are receiving this mail because: -------
You are watching all bug changes.
https://bugs.winehq.org/show_bug.cgi?id=44838
Bug ID: 44838
Summary: Diablo 2 graphics became glitchy starting with Wine
Version 3.2
Product: Wine
Version: 3.4
Hardware: x86
OS: Linux
Status: UNCONFIRMED
Severity: major
Priority: P2
Component: -unknown
Assignee: wine-bugs(a)winehq.org
Reporter: wodencafe(a)gmail.com
Distribution: ---
Starting with Wine 3.2 and on, Diablo 2 is rendering very strangely and badly,
lots of flickering and black squares.
It's hard to describe so I have attached a video comparison with 3.1, which
works fine.
Tested with 3.2, 3.3, and 3.4, and all have the flicker / black squares
problems. 3.1 and prior are fine.
This is with no wine modifications beyond installing Diablo 2 & Lord of
Destruction.
Please see the video for example of problem, and comparison of when it was
working with 3.1
--
Do not reply to this email, post in Bugzilla using the
above URL to reply.
You are receiving this mail because:
You are watching all bug changes.
https://bugs.winehq.org/show_bug.cgi?id=44125
Bug ID: 44125
Summary: x11drv: Can't allocate handle for display fd x11drv:
Can't store handle for display fd
Product: Wine
Version: 2.22
Hardware: x86-64
OS: Linux
Status: UNCONFIRMED
Severity: normal
Priority: P2
Component: -unknown
Assignee: wine-bugs(a)winehq.org
Reporter: noel.kuntze+bugs.winehq(a)thermi.consulting
Distribution: ---
The following errors are printed by wine, additionally with the game crashing
or exiting game sessions is happening with wine 2.22 while playing World of
Warships:
x11drv: Can't allocate handle for display fd
x11drv: Can't store handle for display fd
Possibly a regression re 39268
--
Do not reply to this email, post in Bugzilla using the
above URL to reply.
You are receiving this mail because:
You are watching all bug changes.
http://bugs.winehq.org/show_bug.cgi?id=36896
Bug ID: 36896
Summary: Audiosurf Quest 3D error
Product: Wine
Version: 1.7.22
Hardware: x86-64
OS: Linux
Status: UNCONFIRMED
Severity: normal
Priority: P2
Component: -unknown
Assignee: wine-bugs(a)winehq.org
Reporter: levanchelidze(a)gmail.com
Created attachment 49003
--> http://bugs.winehq.org/attachment.cgi?id=49003
steam terminal output
I installed Steam on fresh wineprefix and then downloaded Audiosurf and started
it I got an error here is a screenshot of it
http://i.imgur.com/RTXFHoD.png
and terminal outputs
--
Do not reply to this email, post in Bugzilla using the
above URL to reply.
You are receiving this mail because:
You are watching all bug changes.
http://bugs.winehq.org/show_bug.cgi?id=35997
Bug ID: 35997
Summary: Polar Websync 2.8.1 not recognizing USB device ( RC3
GPS )
Product: Wine
Version: 1.7.15
Hardware: x86
OS: Linux
Status: UNCONFIRMED
Severity: normal
Priority: P2
Component: -unknown
Assignee: wine-bugs(a)winehq.org
Reporter: evorster(a)gmail.com
Hi there.
Thanks for fixing bug 35284 above.
I installed Websync on my Arch Linux box, and it installed beautifully.
Unfortunately, Websync does not seem to recognize my RC3.
I launch the Websync app, and whether I click on "Training Computer" or
"Synchronize" the app never gets past the "Connect" bit, and the dot next to it
stays red, instead of turning green like it does in Windows boxes when I have
the device plugged in.
I am happy to follow instructions on getting more information for you, and also
building applications from source code and applying patches in testing, as I
used to use a sources-based distrobution before.
Kind regards,
Evert Vorster
--
Do not reply to this email, post in Bugzilla using the
above URL to reply.
You are receiving this mail because:
You are watching all bug changes.
https://bugs.winehq.org/show_bug.cgi?id=47943
Bug ID: 47943
Summary: Can't install .NET Framework 4.5...!!
Product: Wine
Version: 4.0
Hardware: x86-64
OS: Linux
Status: UNCONFIRMED
Severity: normal
Priority: P2
Component: -unknown
Assignee: wine-bugs(a)winehq.org
Reporter: dev(a)intro.ch
Distribution: ---
I did it as your website says:
https://appdb.winehq.org/objectManager.php?sClass=version&iId=25478
Output:
jmarti@debian-martij-dev:~$ wget
'https://raw.githubusercontent.com/Winetricks/winetricks/master/src/winetric…'
--2019-10-16 10:36:19--
https://raw.githubusercontent.com/Winetricks/winetricks/master/src/winetric…
Auflösen des Hostnamens »raw.githubusercontent.com (raw.githubusercontent.com)«
… 151.101.0.133, 151.101.64.133, 151.101.128.133, ...
Verbindungsaufbau zu raw.githubusercontent.com
(raw.githubusercontent.com)|151.101.0.133|:443 … verbunden.
HTTP-Anforderung gesendet, auf Antwort wird gewartet … 200 OK
Länge: 815719 (797K) [text/plain]
Wird in »»winetricks«« gespeichert.
winetricks 100%[===================>] 796.60K --.-KB/s in 0.09s
2019-10-16 10:36:19 (9.04 MB/s) - »»winetricks«« gespeichert [815719/815719]
jmarti@debian-martij-dev:~$ chmod +x ~/winetricks
jmarti@debian-martij-dev:~$ env WINEPREFIX=$HOME/winedotnet wineboot --init
wine: created the configuration directory '/home/jmarti/winedotnet'
0009:err:file:init_redirects cannot open L"C:\\windows" (c000000f)
0012:err:ole:marshal_object couldn't get IPSFactory buffer for interface
{00000131-0000-0000-c000-000000000046}
0012:err:ole:marshal_object couldn't get IPSFactory buffer for interface
{6d5140c1-7436-11ce-8034-00aa006009fa}
0012:err:ole:StdMarshalImpl_MarshalInterface Failed to create ifstub,
hres=0x80004002
0012:err:ole:CoMarshalInterface Failed to marshal the interface
{6d5140c1-7436-11ce-8034-00aa006009fa}, 80004002
0012:err:ole:get_local_server_stream Failed: 80004002
0014:err:ole:marshal_object couldn't get IPSFactory buffer for interface
{00000131-0000-0000-c000-000000000046}
0014:err:ole:marshal_object couldn't get IPSFactory buffer for interface
{6d5140c1-7436-11ce-8034-00aa006009fa}
0014:err:ole:StdMarshalImpl_MarshalInterface Failed to create ifstub,
hres=0x80004002
0014:err:ole:CoMarshalInterface Failed to marshal the interface
{6d5140c1-7436-11ce-8034-00aa006009fa}, 80004002
0014:err:ole:get_local_server_stream Failed: 80004002
Could not load wine-gecko. HTML rendering will be disabled.
Could not load wine-gecko. HTML rendering will be disabled.
wine: configuration in '/home/jmarti/winedotnet' has been updated.
jmarti@debian-martij-dev:~$ 0037:err:ntoskrnl:ZwLoadDriver failed to create
driver L"\\Registry\\Machine\\System\\CurrentControlSet\\Services\\MountMgr":
c0000035
0035:err:service:process_send_command service protocol error - failed to write
pipe!
0036:err:rpc:RpcServerAssoc_FindContextHandle no context handle found for uuid
{547d11a9-ca7c-4aba-bc02-5197078f31b9}, guard (nil)
0043:err:rpc:RpcAssoc_BindConnection rejected bind for reason 0
0023:err:rpc:I_RpcReceive we got fault packet with status 0x1c00001a
0036:err:rpc:RpcServerAssoc_FindContextHandle no context handle found for uuid
{61c914d6-e100-4958-b46e-72c1083239bb}, guard (nil)
0023:err:rpc:I_RpcReceive we got fault packet with status 0x1c00001a
0035:err:rpc:RpcServerAssoc_FindContextHandle no context handle found for uuid
{60f69d71-e7db-4887-8f87-5be0b02a530d}, guard (nil)
0020:err:rpc:I_RpcReceive we got fault packet with status 0x1c00001a
???
Thank you for your feedbacks,
Jan
--
Do not reply to this email, post in Bugzilla using the
above URL to reply.
You are receiving this mail because:
You are watching all bug changes.
https://bugs.winehq.org/show_bug.cgi?id=46109
Bug ID: 46109
Summary: Joxi crash on start
Product: Wine
Version: 3.18
Hardware: x86-64
OS: Linux
Status: UNCONFIRMED
Severity: normal
Priority: P2
Component: -unknown
Assignee: wine-bugs(a)winehq.org
Reporter: sergey(a)ortoped.org.ru
Distribution: ---
Created attachment 62742
--> https://bugs.winehq.org/attachment.cgi?id=62742
bugtrace
I have a new laptop with Fedora 28. I have installed wine (sudo yum install
wine) and downloaded Joxi from http://dl.joxi.ru/windows/direct/Joxi.exe . It
have installed succesfully but crashes on start. See bugtrace.txt
--
Do not reply to this email, post in Bugzilla using the
above URL to reply.
You are receiving this mail because:
You are watching all bug changes.
https://bugs.winehq.org/show_bug.cgi?id=45516
Bug ID: 45516
Summary: trying to install vcrun2010 sp1 x86
Product: Wine
Version: 2.20
Hardware: x86
OS: Linux
Status: UNCONFIRMED
Severity: normal
Priority: P2
Component: -unknown
Assignee: wine-bugs(a)winehq.org
Reporter: 3anuj.behl.75(a)rj-11.cf
Distribution: ---
Created attachment 61901
--> https://bugs.winehq.org/attachment.cgi?id=61901
a program differed from the rest (sqmapi)
a program differed from the rest (sqmapi)
--
Do not reply to this email, post in Bugzilla using the
above URL to reply.
You are receiving this mail because:
You are watching all bug changes.
http://bugs.winehq.org/show_bug.cgi?id=33019
Bug #: 33019
Summary: PDH does not support the 'Object Index' when creating
strings
Product: Wine
Version: 1.5.24
Platform: x86
OS/Version: Linux
Status: NEW
Severity: normal
Priority: P2
Component: pdh
AssignedTo: wine-bugs(a)winehq.org
ReportedBy: ehoover(a)mines.edu
Classification: Unclassified
PDH allows for performance counters to be specified to address a particular
object. For example, on a machine with multiple processors one uses the
index-specific string:
\Processor(_Total#0)\% Processor Time
rather than the generic string:
\Processor(_Total)\% Processor Time
Silverlight uses these index-specific strings to construct the processor time
string, which poses a problem since this is not currently implemented.
--
Configure bugmail: http://bugs.winehq.org/userprefs.cgi?tab=email
Do not reply to this email, post in Bugzilla using the
above URL to reply.
------- You are receiving this mail because: -------
You are watching all bug changes.
http://bugs.winehq.org/show_bug.cgi?id=33018
Bug #: 33018
Summary: PDH does not support the 'Processor' object string
Product: Wine
Version: 1.5.24
Platform: x86
OS/Version: Linux
Status: NEW
Severity: normal
Priority: P2
Component: pdh
AssignedTo: wine-bugs(a)winehq.org
ReportedBy: ehoover(a)mines.edu
Classification: Unclassified
Calling PdhLookupPerfNameByIndex with the index 238 should return the string
'Processor', this is used by Silverlight to construct the string:
\Processor(_Total#0)\% Processor Time
to obtain the processor usage.
--
Configure bugmail: http://bugs.winehq.org/userprefs.cgi?tab=email
Do not reply to this email, post in Bugzilla using the
above URL to reply.
------- You are receiving this mail because: -------
You are watching all bug changes.
https://bugs.winehq.org/show_bug.cgi?id=45002
Bug ID: 45002
Summary: Right click on Android x86 and physical mouse is not
working as genuine right mouse click
Product: Wine
Version: 3.6
Hardware: x86
OS: Linux
Status: UNCONFIRMED
Severity: blocker
Priority: P2
Component: -unknown
Assignee: wine-bugs(a)winehq.org
Reporter: ruthan(a)email.cz
Distribution: ---
Hello,
physical mouse on Androidx86 wine is not working well, left click is somehow
mixed with right click and right click not working as it should.. I dunno, if
it could be fixed on Wine side, or some Androidx86 fixes are needed, overall
user experience sucks.
Tested on Steam client and games like Unreal Tournament 99 demo, which is
working at least in Safe mode and with software renderer.
--
Do not reply to this email, post in Bugzilla using the
above URL to reply.
You are receiving this mail because:
You are watching all bug changes.
https://bugs.winehq.org/show_bug.cgi?id=38329
Bug ID: 38329
Summary: 64-bit Double Commander hangs
Product: Wine
Version: 1.7.38
Hardware: x86-64
URL: https://sourceforge.net/projects/doublecmd/files/DC%20
for%20Windows%2064%20bit/
OS: Linux
Status: UNCONFIRMED
Severity: normal
Priority: P2
Component: -unknown
Assignee: wine-bugs(a)winehq.org
Reporter: jhansonxi(a)gmail.com
Distribution: ---
The 64-bit version of open-source file manager Double Commander hangs at
execution, loading the CPU at 100%. The 32-bit version is not affected.
Occurs with 0.5.11, 0.6.0, and 0.6.1 betas.
Xubuntu 14.04.2 x86_64
--
Do not reply to this email, post in Bugzilla using the
above URL to reply.
You are receiving this mail because:
You are watching all bug changes.
https://bugs.winehq.org/show_bug.cgi?id=39841
Bug ID: 39841
Summary: Double Commander context menus missing most entries
Product: Wine
Version: 1.8
Hardware: x86
URL: http://sourceforge.net/p/doublecmd/wiki/Download/
OS: Linux
Status: UNCONFIRMED
Severity: normal
Priority: P2
Component: shell32
Assignee: wine-bugs(a)winehq.org
Reporter: jhansonxi(a)gmail.com
Distribution: Ubuntu
Double Commander 0.6.6 beta build 6327M
32-bit (64-bit doesn't function as per bug #38329)
Right-clicking in an empty space within the directory view in WinXP shows
"Refresh, Sort by, Paste, New Properties". In Wine it triggers an error dialog
stating "Error: Invalid parameter".
Right clicking on a a text file in WinXP shows "Open, Print, Edit, Open with,
Actions, Send to, Cut, Copy, Create shortcut, Delete, Rename, Properties". In
Wine it only shows "Actions>View, Edit". Wine reports:
fixme:shell:ContextMenu_HandleMenuMsg2 (0x2dd8ed0)->(0x117 0x602c6 0x0
0x1b7ead4): stub
--
Do not reply to this email, post in Bugzilla using the
above URL to reply.
You are receiving this mail because:
You are watching all bug changes.
https://bugs.winehq.org/show_bug.cgi?id=43577
Bug ID: 43577
Summary: unit test: DBGrid inplace editor dropdown does not
work and worked on version 2.0.2
Product: Wine
Version: 2.14
Hardware: x86
OS: Linux
Status: UNCONFIRMED
Severity: normal
Priority: P2
Component: -unknown
Assignee: wine-bugs(a)winehq.org
Reporter: Brad.Wine1(a)amaitis.com
Distribution: ---
version 2.0.2 works
winehq-devel
wine --version
wine-2.13
and
wine-2.14
If you click the dropdown in the Show column on the grid stable 2.0.2 works and
the 2.13 and 2.14 dev version does not let you select from the list shown to
change the value of the field.
http://www.ateksol.com/dev/unittest/GridDropDown.exe
sha1sum
cea42ec431f985a802203be10e4cae6abe6afde5 GridDropDown.exe
--
Do not reply to this email, post in Bugzilla using the
above URL to reply.
You are receiving this mail because:
You are watching all bug changes.
https://bugs.winehq.org/show_bug.cgi?id=43608
Bug ID: 43608
Summary: Altium Designer: Drop down menu entry not clickable
since Wine 2.13
Product: Wine
Version: 2.13
Hardware: x86-64
OS: Linux
Status: UNCONFIRMED
Severity: normal
Priority: P2
Component: -unknown
Assignee: wine-bugs(a)winehq.org
Reporter: afb(a)mailbox.org
Distribution: ---
Since upgrade to Wine 2.13 and further, Altium Designer 17 returns the
following error when selecting an entry in any drop down menu:
Cannot focus a disabled or invisible window at 3008640F.
AdvSch.dll, Base Address: 2FE60000.
The drop down menu then resets. At this time, with parameter warn-all, Wine
2.13 outputs the following debug message:
fixme:explorerframe:taskbar_list_AddTab iface 0x10680510, hwnd 0x1053c stub!
fixme:explorerframe:taskbar_list_ActivateTab iface 0x10680510, hwnd 0x1053c
stub!
When selecting any menu entry with the return key instead, Altium Designer
works as expected.
The last Wine version showing expected behaviour is 2.12. OS is 4.12.8-2-ARCH.
--
Do not reply to this email, post in Bugzilla using the
above URL to reply.
You are receiving this mail because:
You are watching all bug changes.
https://bugs.winehq.org/show_bug.cgi?id=43630
Bug ID: 43630
Summary: Altium Designer Installer - Richedit control shows rtf
code instead of text
Product: Wine
Version: 2.15
Hardware: x86
URL: https://s3.amazonaws.com/altium-release-manager/Altium
_Designer_17/AltiumDesignerSetup_17_1_6.exe
OS: Linux
Status: UNCONFIRMED
Severity: normal
Priority: P2
Component: richedit
Assignee: wine-bugs(a)winehq.org
Reporter: dark.shadow4(a)web.de
Distribution: ---
Just download the attached installer, click 'Next' and change the language to
German. It doesn't show German text, but richedit coded text.
winetricks "riched20" works as workaround.
Side note: Currently hard to test, since it's blocked by Bug 43608/Bug 43577.
But it's still existent in wine-2.15 if you account for the regression.
--
Do not reply to this email, post in Bugzilla using the
above URL to reply.
You are receiving this mail because:
You are watching all bug changes.
https://bugs.winehq.org/show_bug.cgi?id=50147
Bug ID: 50147
Summary: Microsoft WebView2 "evergreen bootstrapper"/installer
needs IStream_CopyTo
Product: Wine
Version: 5.21
Hardware: x86-64
URL: https://developer.microsoft.com/en-us/microsoft-edge/w
ebview2/
OS: Linux
Status: UNCONFIRMED
Severity: normal
Priority: P2
Component: shlwapi
Assignee: wine-bugs(a)winehq.org
Reporter: bshanks(a)codeweavers.com
Distribution: ---
The "evergreen bootstrapper" installer for Microsoft's WebView2 runtime uses
IStream_CopyTo() from memory to a file. With a quick hack implementation it
launched and appeared to install the runtime correctly.
--
Do not reply to this email, post in Bugzilla using the
above URL to reply.
You are receiving this mail because:
You are watching all bug changes.
https://bugs.winehq.org/show_bug.cgi?id=48578
Bug ID: 48578
Summary: Sky Go app crashes on startup
Product: Wine
Version: 5.0
Hardware: x86
OS: Linux
Status: UNCONFIRMED
Severity: normal
Priority: P2
Component: -unknown
Assignee: wine-bugs(a)winehq.org
Reporter: justus.jones(a)posteo.org
Distribution: Other
Created attachment 66411
--> https://bugs.winehq.org/attachment.cgi?id=66411
Terminal output with WINEDLLOVERRIDES=libGLESv2.dll=d
The Sky Go app (OnDemand Pay TV in Germany) crashes on startup after briefly
showing a splash screen.
The installer for the app can be downloaded here:
https://www.sky.de/produkte/sky-go-158150
There's no version information.
$ sha256sum Sky\ Go.exe
7924160fd16917e96a17146017d1bc70085e1674610ba9ccb91da4747cfccb14 Sky Go.exe
I've tried with wine and wine-staging 5.0, both with the hack from
https://bugs.winehq.org/show_bug.cgi?id=44055 in dwmapi_main.c applied to avoid
an error regarding the Aero theme.
Running the app without any dll overrides results in a black window as
described in https://bugs.winehq.org/show_bug.cgi?id=44985 and the app crashing
after a few seconds.
Using WINEDLLOVERRIDES=libGLESv2.dll=d shows the splash screen, the app checks
for updates which seems to work (the "Checking for updates" message disappears
after a few seconds), window controls (minimize, maximize, close buttons)
appear in the top right corner. Then the app crashes without any error message.
--
Do not reply to this email, post in Bugzilla using the
above URL to reply.
You are receiving this mail because:
You are watching all bug changes.
https://bugs.winehq.org/show_bug.cgi?id=44178
Bug ID: 44178
Summary: Diablo 2 locks up when connecting to battle.net
Product: Wine
Version: 3.0-rc1
Hardware: x86
OS: Linux
Status: UNCONFIRMED
Severity: normal
Priority: P2
Component: -unknown
Assignee: wine-bugs(a)winehq.org
Reporter: bruce(a)biz.winehq.zuhause.org
Distribution: ---
Created attachment 59942
--> https://bugs.winehq.org/attachment.cgi?id=59942
output from wine command
This started occurring a couple of days ago, running on a wine 1.x version. I
upgraded to Wine 3.0-rc1 and here is the log from the terminal window. Note
that the last few lines, starting with
0043:fixme:win:UnregisterDeviceNotification (handle=0xcafeaffe), STUB! take
place minutes after it locks up, after I click on the close window button.
--
Do not reply to this email, post in Bugzilla using the
above URL to reply.
You are receiving this mail because:
You are watching all bug changes.
http://bugs.winehq.org/show_bug.cgi?id=15315
Summary: Ace Online (aka Space Cowboy/Flysis/Air Rivals) does not
load past launcher with WINE
Product: Wine
Version: 1.0-rc3
Platform: PC
OS/Version: Linux
Status: UNCONFIRMED
Severity: normal
Priority: P2
Component: -unknown
AssignedTo: wine-bugs(a)winehq.org
ReportedBy: littlegator(a)gmail.com
I'm somewhat new to Linux, so if anyone offers any fixes, I may not be sure how
to do it. Please inform me of the exact procedure of the fix (or anything that
may advance the situation) and I will gladly do what you ask.
Now, on to the problem. I load up Ace Online with WINE 1.0-rc3 and it brings me
to the launcher. I type in my login details, select my resolution (which is
1024 x 768), uncheck the "windowed" check box (which appears to have no effect
on the output), and wait. The game goes full screen and is white for a few
seconds. It switches to black, then, after about 10 or 15 seconds, a white
square appears in the middle of the screen. It disappear within a few frames of
appearing, and I'm stuck here. Same thing happens when windowed, it just isn't
full screen. During this process, it seems to be outputting every single
mission log in the game to the debug window. The output file is extremely long.
Now, my setup:
I'm running WINE 1.0-rc3 with DirectX9.0 installed using WineTricks. I'm
running a 1024x768 virtual desktop with no window decorations and window
manager can not control the windows.
My PC:
Intel Pentium 4 1.6GHz
512MB RAM (not sure on what type >_>)
ATI Radeon 9700 pro 128MB onboard RAM using latest Catalyst drivers
running 3.5.6-9.fc7 Fedora release: 2.6.21-1.3194.fc7
While I await a response, I'm going to attempt updating Fedora since it's
apparently an older version. I've attached the a couple output files and a
dxdiag if it may be useful.
--
Configure bugmail: http://bugs.winehq.org/userprefs.cgi?tab=email
Do not reply to this email, post in Bugzilla using the
above URL to reply.
------- You are receiving this mail because: -------
You are watching all bug changes.
http://bugs.winehq.org/show_bug.cgi?id=27716
Summary: Dragon Nest (Chinese): crashes before login screen
Product: Wine
Version: 1.3.21
Platform: x86-64
OS/Version: Linux
Status: UNCONFIRMED
Severity: normal
Priority: P2
Component: directx-d3d
AssignedTo: wine-bugs(a)winehq.org
ReportedBy: eric.gralco(a)gmail.com
Created an attachment (id=35467)
--> (http://bugs.winehq.org/attachment.cgi?id=35467)
Fixmes that are thrown during the crash
The game must be started from dnlauncher.exe. After the loading screen the game
goes to the animation before the login screen where it crashes. For the record
the game also lags at this point on Windows but does not crash.
--
Configure bugmail: http://bugs.winehq.org/userprefs.cgi?tab=email
Do not reply to this email, post in Bugzilla using the
above URL to reply.
------- You are receiving this mail because: -------
You are watching all bug changes.
https://bugs.winehq.org/show_bug.cgi?id=45254
Bug ID: 45254
Summary: Buffer overflow, X file children MAX_CHILDREN limit
too small, crashes BIONICLE: The Legend of Mata Nui
Product: Wine
Version: unspecified
Hardware: x86
OS: Linux
Status: UNCONFIRMED
Severity: normal
Priority: P2
Component: directx-d3dxof
Assignee: wine-bugs(a)winehq.org
Reporter: legojrmastermodelbuilder(a)gmail.com
Distribution: ---
In dlls/d3dxof/d3dxof_private.h MAX_CHILDREN is defined as 200, which is too
small a buffer for some existing DirectX model .X files:
https://github.com/wine-mirror/wine/blob/4102d8a0dc1b02d37d834f17d1925f3b0d…
In dlls/d3dxof/parsing.c there is actually a warning if that number is
exceeded, but the bounds checking happens after the buffer would be overflown,
so it may read the wrong value or simply crash instead:
https://github.com/wine-mirror/wine/blob/99a5afc09b1e8928a2b3270ce67784083d…
Native Windows does not appear to impose a hard limit, or if there is one it is
larger than 0xFFFF (the highest size I tested).
This limitation impacts at least one Windows application, namely the game
BIONICLE: The Legend of Mata Nui.
This would impact Wine on all platforms.
GitHub issue for reference:
https://github.com/TheLegendOfMataNui/game-issues/issues/110
--
Do not reply to this email, post in Bugzilla using the
above URL to reply.
You are receiving this mail because:
You are watching all bug changes.
http://bugs.winehq.org/show_bug.cgi?id=12694
Summary: Air Rival Crashes after login
Product: Wine
Version: 0.9.59.
Platform: PC
URL: http://appdb.winehq.org/objectManager.php?sClass=version
&iId=11224&iTestingId=22275
OS/Version: Linux
Status: UNCONFIRMED
Severity: enhancement
Priority: P2
Component: -unknown
AssignedTo: wine-bugs(a)winehq.org
ReportedBy: mifuyne(a)gmail.com
Created an attachment (id=12349)
--> (http://bugs.winehq.org/attachment.cgi?id=12349)
Log of Air Rival from Launch to Crash
The game crashes without going into the game itself. Been tested on different
versions of Windows (slightly different error on some version). The following
address leads to the log, from launcher to the crash point. It's also attached
to this report.
http://pastebin.org/30959
WINE was set to Emulate a virtual desktop at 1024 x 768 (thus avoiding the
resolution problem mentioned here:
http://appdb.winehq.org/objectManager.php?sClass=version&iId=11224&iTesting…
--
Configure bugmail: http://bugs.winehq.org/userprefs.cgi?tab=email
Do not reply to this email, post in Bugzilla using the
above URL to reply.
------- You are receiving this mail because: -------
You are watching all bug changes.
https://bugs.winehq.org/show_bug.cgi?id=47664
Bug ID: 47664
Summary: Program APT refuses to load on starting.
Product: Wine
Version: 4.0.1
Hardware: x86
OS: Linux
Status: UNCONFIRMED
Severity: critical
Priority: P2
Component: -unknown
Assignee: wine-bugs(a)winehq.org
Reporter: wes(a)mudlakepottery.com
Distribution: ---
Created attachment 65107
--> https://bugs.winehq.org/attachment.cgi?id=65107
error trace of APT load failure
APT loads up to install of therm and humidity sensors and crashes, never fully
loads.
--
Do not reply to this email, post in Bugzilla using the
above URL to reply.
You are receiving this mail because:
You are watching all bug changes.
https://bugs.winehq.org/show_bug.cgi?id=44192
Bug ID: 44192
Summary: Dragon Age Origins Awakening installer deadlock when
extracting files
Product: Wine
Version: 2.21
Hardware: x86
OS: Linux
Status: UNCONFIRMED
Severity: normal
Priority: P2
Component: -unknown
Assignee: wine-bugs(a)winehq.org
Reporter: lorenzofer(a)live.it
Distribution: ---
Created attachment 59959
--> https://bugs.winehq.org/attachment.cgi?id=59959
Wine log
Trying to install Dragon Age Awakening in a clean wineprefix (where there is
already installed Origins) result in a deadlock after ending file extraction.
The installer thus hang completly and must be killed.
Awakenings is composed of two compressed files, one for "core" files, and one
for "addons" file. It's completly random on which file it hangs, sometimes on
the first file sometimes on the second, but is hanging always after it
extracted the last file of the archive (the last line of the installer log is
Extract: packages or Extract : addons with the extracting file percentual
progression, blocking at 99.4% or 100% )
In the log I'm getting:
err:ntdll:RtlpWaitForCriticalSection section 0x7bd1cbc0
"../../../dlls/ntdll/loader.c: loader_section" wait timed out in thread 0009,
bl
ocked by 002d, retrying (60 sec)
err:ntdll:RtlpWaitForCriticalSection section 0x7bd1cbc0
"../../../dlls/ntdll/loader.c: loader_section" wait timed out in thread 0032,
bl
ocked by 002d, retrying (60 sec)
err:ntdll:RtlLeaveCriticalSection section 0x117b0 is not acquired
multiple times.
The log is from Wine stagin 2.21, but I tested also with the last wine 3.0rc2
and doesn't change of a comma.
(While searching for similar bugs I found this Bug 22091, but is marked as
fixed, and mention a crash I'm not having)
--
Do not reply to this email, post in Bugzilla using the
above URL to reply.
You are receiving this mail because:
You are watching all bug changes.
http://bugs.winehq.org/show_bug.cgi?id=35116
Bug ID: 35116
Summary: War Rock crash after Updater (startup)
Product: Wine
Version: 1.4.1
Hardware: x86-64
OS: Linux
Status: UNCONFIRMED
Severity: normal
Priority: P2
Component: directx-d3d
Assignee: wine-bugs(a)winehq.org
Reporter: juliantheel(a)gmail.com
Classification: Unclassified
Created attachment 46845
--> http://bugs.winehq.org/attachment.cgi?id=46845
Fail
After starting this game (Updater runs) this errror appears.
--
Do not reply to this email, post in Bugzilla using the
above URL to reply.
You are receiving this mail because:
You are watching all bug changes.
https://bugs.winehq.org/show_bug.cgi?id=43564
Bug ID: 43564
Summary: Prey Demo texture/lighting issues
Product: Wine
Version: 2.14
Hardware: x86-64
OS: Linux
Status: UNCONFIRMED
Severity: normal
Priority: P2
Component: -unknown
Assignee: wine-bugs(a)winehq.org
Reporter: plata(a)mailbox.org
Distribution: ---
Almost everything is really dark (looks like a room without light). However,
some things like the computer screen seem to have the correct
textures/lighting.
--
Do not reply to this email, post in Bugzilla using the
above URL to reply.
You are receiving this mail because:
You are watching all bug changes.
http://bugs.winehq.org/show_bug.cgi?id=34625
Bug #: 34625
Summary: Drakan demo doesn't detect that the graphics card
supports antialiasing
Product: Wine
Version: 1.7.3
Platform: x86
OS/Version: Linux
Status: UNCONFIRMED
Severity: minor
Priority: P2
Component: -unknown
AssignedTo: wine-bugs(a)winehq.org
ReportedBy: winebugs140(a)gmail.com
Classification: Unclassified
Created attachment 46141
--> http://bugs.winehq.org/attachment.cgi?id=46141
Drakan Log
The antialiasing option is grayed out in a preferences window that shows up
when you start the game as well as in in-game settings.
Tested with:
Windows Vista (without Wine), GeForce 9600M GS--the program works fine here
Ubuntu 13.04, GeForce 9600M GS (NVIDIA driver 313)
Mac OS X 10.7.5, ATI HD 2600 Pro, Mac Driver/X11
--
Configure bugmail: http://bugs.winehq.org/userprefs.cgi?tab=email
Do not reply to this email, post in Bugzilla using the
above URL to reply.
------- You are receiving this mail because: -------
You are watching all bug changes.
https://bugs.winehq.org/show_bug.cgi?id=49434
Bug ID: 49434
Summary: Wine Gecko crashes upon loading Google Account login
page
Product: Wine-gecko
Version: unspecified
Hardware: x86-64
OS: Linux
Status: UNCONFIRMED
Severity: major
Priority: P2
Component: wine-gecko-unknown
Assignee: jacek(a)codeweavers.com
Reporter: rare_energy(a)protonmail.com
Distribution: ---
Created attachment 67521
--> https://bugs.winehq.org/attachment.cgi?id=67521
Gecko backtrace
Wine Gecko will crash upon visiting https://accounts.google.com/signin/v2
It will work when browsing other sites, though.
Wine versions tested: 5.0.1 and 5.6, both 64-bit with wine32 support.
Wine Gecko versions 2.47.1, both the x86 and x86_64 packages installed.
I've included a backtrace.
--
Do not reply to this email, post in Bugzilla using the
above URL to reply.
You are receiving this mail because:
You are watching all bug changes.
http://bugs.winehq.org/show_bug.cgi?id=24893
Summary: Explorer++ is missing most right-click options for
files/folders
Product: Wine
Version: 1.3.5
Platform: x86-64
URL: http://www.explorerplusplus.com/download
OS/Version: Linux
Status: UNCONFIRMED
Severity: normal
Priority: P2
Component: -unknown
AssignedTo: wine-bugs(a)winehq.org
ReportedBy: RandomAccountName(a)mail.com
Created an attachment (id=31524)
--> (http://bugs.winehq.org/attachment.cgi?id=31524)
Log from right-clicking a folder, then a file
Expected behavior:
Right-clicking on a file should open the same menu that would be seen in
Windows Explorer (or Winefile as the case may be), while right-clicking a
folder should do the same, but with an added "open in new tab" option.
Actual behavior:
Right-clicking on a file produces a menu with a single option, which may be
blank or random garbage. It doesn't appear to do anything either way.
Right-clicking on a folder yields a menu with only the option "open in new
tab."
--
Configure bugmail: http://bugs.winehq.org/userprefs.cgi?tab=email
Do not reply to this email, post in Bugzilla using the
above URL to reply.
------- You are receiving this mail because: -------
You are watching all bug changes.
https://bugs.winehq.org/show_bug.cgi?id=47310
Bug ID: 47310
Summary: Canon TS3100 series full driver & software package,
installation is blocked after WinZip extraction with
the message, "To install the software, you must be
logged in to an administrator account."
Product: Wine
Version: 4.0.1
Hardware: x86-64
OS: Linux
Status: UNCONFIRMED
Severity: major
Priority: P2
Component: -unknown
Assignee: wine-bugs(a)winehq.org
Reporter: fzcooper(a)gmail.com
Distribution: ---
Created attachment 64617
--> https://bugs.winehq.org/attachment.cgi?id=64617
Error message given by attempted installation.
>From https://wiki.winehq.org/FAQ#Should_I_run_Wine_as_root.3F
"As far as Windows programs are concerned, you are running with administrator
privileges. If an application complains about a lack of administrator
privileges, file a bug; running Wine as root probably won't help."
The TS3122 printer / scanner offers network functionality or I wouldn't even
try the driver in Wine. The Linux counterpart is lacking in features.
Driver download available at:
https://www.usa.canon.com/internet/portal/us/home/support/details/printers/…
The error message appears after this output on both the win7 and win7-x64
versions:
...
Wine-gdb> 003d:fixme:nls:GetThreadPreferredUILanguages 00000038, 0x33faa0,
0x33fab0 0x33faa4
003d:fixme:nls:get_dummy_preferred_ui_language (0x38 0x33faa0 0x33fab0
0x33faa4) returning a dummy value (current locale)
003f:fixme:font:get_outline_text_metrics failed to read full_nameW for font
L"Ani"!
003f:fixme:nls:GetThreadPreferredUILanguages 00000038, 0x23f360, 0x23f370
0x23f364
003f:fixme:nls:get_dummy_preferred_ui_language (0x38 0x23f360 0x23f370
0x23f364) returning a dummy value (current locale)
003f:fixme:nls:GetThreadPreferredUILanguages 00000004, 0x23e8f0, 0x23e900
0x23e8f4
003f:fixme:nls:get_dummy_preferred_ui_language (0x4 0x23e8f0 0x23e900 0x23e8f4)
returning a dummy value (current locale)
003f:fixme:wtsapi:WTSQuerySessionInformationW Stub (nil) 0x00000001 5 0x23f2e0
0x23f304
003f:fixme:wtsapi:WTSQuerySessionInformationW Stub (nil) 0x00000001 7 0x23f2f0
0x23f304
Older versions of windows are not supported for this driver and there is no
download available.
--
Do not reply to this email, post in Bugzilla using the
above URL to reply.
You are receiving this mail because:
You are watching all bug changes.
https://bugs.winehq.org/show_bug.cgi?id=48123
Bug ID: 48123
Summary: Word 97 crashes after calling stub
URLMoniker_ComposeWith
Product: Wine
Version: 4.20
Hardware: x86-64
OS: Linux
Status: UNCONFIRMED
Severity: normal
Priority: P2
Component: urlmon
Assignee: wine-bugs(a)winehq.org
Reporter: magiblot(a)hotmail.com
Distribution: ---
Created attachment 65715
--> https://bugs.winehq.org/attachment.cgi?id=65715
Backtrace generated by the Wine debugger
This function is used by Word 97's Web browsing features. Clicking on an
hyperlink or using the Web toolbar triggers this function and the program
crashes shortly afterwards.
The following warnings are printed when clicking on an hyperlink:
> 002c:fixme:hlink:IHlinkBC_Register (00A9D9E0)->(0 009B02BC 00A9DA00 00986A3C)
> 002c:fixme:ole:ItemMonikerImpl_Construct lpszDelim is NULL. Using empty string which is possibly wrong.
> 002c:fixme:ole:ItemMonikerImpl_Construct lpszDelim is NULL. Using empty string which is possibly wrong.
> 002c:fixme:urlmon:URLMoniker_ComposeWith (009EA280)->(00A9E3C0,1,0032F0D8): stub
> wine: Unhandled page fault on read access to 00000000 at address 7E39398D (thread 002c), starting debugger...
I am not absolutely sure URLMoniker_ComposeWith is responsible for the crash,
but it is certainly suspicious. The crash actually happens in
CreateGenericComposite from ole32.
--
Do not reply to this email, post in Bugzilla using the
above URL to reply.
You are receiving this mail because:
You are watching all bug changes.
https://bugs.winehq.org/show_bug.cgi?id=47296
Bug ID: 47296
Summary: just a crash in google grive
Product: Wine
Version: unspecified
Hardware: x86
OS: Linux
Status: UNCONFIRMED
Severity: normal
Priority: P2
Component: programs
Assignee: wine-bugs(a)winehq.org
Reporter: richardherist(a)outlook.com
Distribution: ---
Created attachment 64595
--> https://bugs.winehq.org/attachment.cgi?id=64595
what error stated
I installed drive and get this error before signing in
--
Do not reply to this email, post in Bugzilla using the
above URL to reply.
You are receiving this mail because:
You are watching all bug changes.
http://bugs.winehq.org/show_bug.cgi?id=12457
Summary: SharpDevelop 2.2 crashes with NotImplementedException at
IWebBrowser2.get_LocationName()
Product: Wine
Version: CVS/GIT
Platform: Other
URL: http://www.icsharpcode.net/OpenSource/SD/Download/#Sharp
Develop22
OS/Version: other
Status: NEW
Keywords: download
Severity: normal
Priority: P2
Component: shdocvw
AssignedTo: wine-bugs(a)winehq.org
ReportedBy: dank(a)kegel.com
http://lists.ximian.com/pipermail/mono-devel-list/2008-March/027227.html
was asking how to install SharpDevelop 2 under Wine, so I
gave it a try. "winetricks dotnet20" was enough to get it
to install and start, but after it put up the GUI, it
aborted with
fixme:shdocvw:WebBrowser_QueryInterface
(0x1af830)->({00000144-0000-0000-c000-000000000046} 0x33e800) interface not
supported
...
FATAL- System.NotImplementedException: The method or operation is not
implemented.
at System.Windows.Forms.UnsafeNativeMethods.IWebBrowser2.get_LocationName()
at System.Windows.Forms.WebBrowser.get_DocumentTitle()
--
Configure bugmail: http://bugs.winehq.org/userprefs.cgi?tab=email
Do not reply to this email, post in Bugzilla using the
above URL to reply.
------- You are receiving this mail because: -------
You are watching all bug changes.
https://bugs.winehq.org/show_bug.cgi?id=48412
Bug ID: 48412
Summary: Call of Duty: Modern Warfare 2 lighting issue and
textures blinking
Product: Wine
Version: 4.21
Hardware: x86-64
OS: Linux
Status: NEW
Keywords: regression
Severity: normal
Priority: P2
Component: directx-d3d
Assignee: wine-bugs(a)winehq.org
Reporter: andrey.goosev(a)gmail.com
CC: sagawa.aki+winebugs(a)gmail.com
Regression SHA1: 54edd5b220116febe704ecef8b3fb86621793ebe
Distribution: ---
Created attachment 66183
--> https://bugs.winehq.org/attachment.cgi?id=66183
screenshot
Blinking happens periodically.
--
Do not reply to this email, post in Bugzilla using the
above URL to reply.
You are receiving this mail because:
You are watching all bug changes.
http://bugs.winehq.org/show_bug.cgi?id=29903
Bug #: 29903
Summary: Microsoft Visual Studio 2005: enumeration of processes
fails due to wtsapi32.WTSEnumerateProcessesW() being a
stub ( "attach to process" menu))
Product: Wine
Version: 1.4-rc3
Platform: x86
OS/Version: Linux
Status: NEW
Severity: normal
Priority: P2
Component: -unknown
AssignedTo: wine-bugs(a)winehq.org
ReportedBy: focht(a)gmx.net
Classification: Unclassified
Hello,
clicking "attach to process" menu item with default "local transport" leads to
an error message stating "Operation not supported. Unknown error: 0x8007000e".
The process list (listview) is empty due to WTSEnumerateProcessesW() API being
a stub.
Prerequisite: 'winetricks -q dotnet20 mfc42'
--- snip ---
...
0024:Call
wtsapi32.WTSEnumerateProcessesW(00000000,00000000,00000001,0032e828,0032e824)
ret=54bc508e
0024:fixme:wtsapi:WTSEnumerateProcessesW Stub (nil) 0x00000000 0x00000001
0x32e828 0x32e824
0024:Ret wtsapi32.WTSEnumerateProcessesW() retval=00000001 ret=54bc508e
0024:Call KERNEL32.GetProcAddress(7d910000,54cb3b3c "WTSFreeMemory")
ret=54bb97d2
0024:Ret KERNEL32.GetProcAddress() retval=7d914fc8 ret=54bb97d2
0024:Call wtsapi32.WTSFreeMemory(00000000) ret=54bc51b9
0024:fixme:wtsapi:WTSFreeMemory Stub (nil)
0024:Ret wtsapi32.WTSFreeMemory() retval=0000002b ret=54bc51b9
...
0024:Call oleaut32.SysAllocString(011722a8 L"Unable to connect to the Microsoft
Visual Studio Remote Debugging Monitor named 'nexus4'. Operation not
supported. Unknown error: 0x8007000e.") ret=54ba4f0c
...
--- snip ---
MSDN: http://msdn.microsoft.com/en-us/library/windows/desktop/aa383831.aspx
Stub source:
http://source.winehq.org/git/wine.git/blob/fddbf3b99d6582c50ede10dfddd8d438…
--- snip ---
--- snip ---
105 BOOL WINAPI WTSEnumerateProcessesW(HANDLE hServer, DWORD Reserved, DWORD
Version,
106 PWTS_PROCESS_INFOW* ppProcessInfo, DWORD* pCount)
107 {
108 FIXME("Stub %p 0x%08x 0x%08x %p %p\n", hServer, Reserved, Version,
109 ppProcessInfo, pCount);
110
111 if (!ppProcessInfo || !pCount) return FALSE;
112
113 *pCount = 0;
114 *ppProcessInfo = NULL;
115
116 return TRUE;
117 }
--- snip ---
$ wine --version
wine-1.4-rc3-65-g98f0be8
Regards
--
Configure bugmail: http://bugs.winehq.org/userprefs.cgi?tab=email
Do not reply to this email, post in Bugzilla using the
above URL to reply.
------- You are receiving this mail because: -------
You are watching all bug changes.
http://bugs.winehq.org/show_bug.cgi?id=19756
Summary: TaskCoach: Cannot add new task with a due date
Product: Wine
Version: 1.1.27
Platform: PC
URL: http://www.taskcoach.org/download.html
OS/Version: Linux
Status: UNCONFIRMED
Severity: normal
Priority: P2
Component: -unknown
AssignedTo: wine-bugs(a)winehq.org
ReportedBy: jekwas(a)gmail.com
Created an attachment (id=23126)
--> (http://bugs.winehq.org/attachment.cgi?id=23126)
taskcoach.exe.log
I ran across this while testing for 8322. Task Coach is unable to add a new
task if a Due Date is specified.
To reproduce, click "New task" in the main window. Go to the Dates tab and add
a due date. Press OK, and nothing will happen. When you close Task Coach, it
will alert you of logged errors.
I have attached such a log. (Wine doesn't output with any problems when trying
to add a task)
--
Configure bugmail: http://bugs.winehq.org/userprefs.cgi?tab=email
Do not reply to this email, post in Bugzilla using the
above URL to reply.
------- You are receiving this mail because: -------
You are watching all bug changes.
https://bugs.winehq.org/show_bug.cgi?id=49663
Bug ID: 49663
Summary: Performance regression in TrackMania Nations Forever
Product: Wine
Version: 5.14
Hardware: x86-64
OS: Linux
Status: UNCONFIRMED
Severity: normal
Priority: P2
Component: msvcrt
Assignee: wine-bugs(a)winehq.org
Reporter: phatboi1337(a)gmail.com
Regression SHA1: f02193738c88bea8fefb3f8d2e79c5e9941f6b5a
Distribution: ArchLinux
Hi there!
As of f02193738c88bea8fefb3f8d2e79c5e9941f6b5a, performance in TrackMania
Nations Forever has dropped from ~250 fps to ~72 fps on the A01-Race map.
The issue only seems to be present when DXVK is being used. WineD3D performance
seems to be unchanged, running at ~120 fps.
The game is available for free, either from Steam or the official website
(http://trackmaniaforever.com/nations/).
--
Do not reply to this email, post in Bugzilla using the
above URL to reply.
You are receiving this mail because:
You are watching all bug changes.
http://bugs.winehq.org/show_bug.cgi?id=12076
Summary: Database app refused to install unless
system32/drivers/etc/{services,host} exist
Product: Wine
Version: CVS/GIT
Platform: Other
OS/Version: other
Status: NEW
Keywords: Installer
Severity: normal
Priority: P2
Component: -unknown
AssignedTo: wine-bugs(a)winehq.org
ReportedBy: dank(a)kegel.com
A user's informix-based app refused to install until
the empty files c:/windows/system32/drivers/etc/{services,host}
were created, see
http://winehq.org/pipermail/wine-users/2008-March/030256.html
I looked around a bit for other system32/drivers/etc files.
http://support.microsoft.com/kb/130024 describes hosts, services, and protocols
http://support.microsoft.com/kb/105997 describes lmhosts
It looks like some apps find that directory by looking at
HKEY_LOCAL_MACHINE\SYSTEM\CurrentControlSet\Services\Tcpip\Parameters\DataBasePath
and MSN Messenger 7.5 f*cks up by changing that variable's type, see
http://bugs.sun.com/bugdatabase/view_bug.do?bug_id=6343068
Getting this all right would be a lot of work. Just creating
two empty files might be reasonable, though, since it
allows the user's app to install.
--
Configure bugmail: http://bugs.winehq.org/userprefs.cgi?tab=email
Do not reply to this email, post in Bugzilla using the
above URL to reply.
------- You are receiving this mail because: -------
You are watching all bug changes.
https://bugs.winehq.org/show_bug.cgi?id=50119
Bug ID: 50119
Summary: Dark Souls II: Scholar of the First Sin shows a white
screen with vulkan renderer
Product: Wine
Version: 5.21
Hardware: x86-64
OS: Linux
Status: NEW
Severity: normal
Priority: P2
Component: directx-d3d
Assignee: wine-bugs(a)winehq.org
Reporter: andrey.goosev(a)gmail.com
Distribution: ---
0580:err:d3d:wined3d_swapchain_vk_blit Present returned vr
VK_ERROR_OUT_OF_DATE_KHR.
0580:err:d3d:wined3d_swapchain_vk_destroy_vulkan_swapchain Failed to wait on
queue, vr VK_ERROR_DEVICE_LOST.
and lots of:
0580:err:d3d:wined3d_context_vk_submit_command_buffer Failed to submit command
buffer 0x7f7fbc1b0e28, vr VK_ERROR_DEVICE_LOST.
wine-5.21-69-gb940c5e7c91
--
Do not reply to this email, post in Bugzilla using the
above URL to reply.
You are receiving this mail because:
You are watching all bug changes.
https://bugs.winehq.org/show_bug.cgi?id=48507
Bug ID: 48507
Summary: osu! icons in the setting and music player are not
being rendered
Product: Wine
Version: 5.0
Hardware: x86
OS: Linux
Status: UNCONFIRMED
Severity: normal
Priority: P2
Component: gdiplus
Assignee: wine-bugs(a)winehq.org
Reporter: huupoke12(a)gmail.com
Distribution: ---
Created attachment 66308
--> https://bugs.winehq.org/attachment.cgi?id=66308
Icons in the setting and the music player are not being drawn/rendered
Icons in the setting and the music player are not being drawn/rendered. I can
still click on the setting and it jumps to that section. But I can't click on
the music player (nothing happen).
--
Do not reply to this email, post in Bugzilla using the
above URL to reply.
You are receiving this mail because:
You are watching all bug changes.
https://bugs.winehq.org/show_bug.cgi?id=46817
Bug ID: 46817
Summary: Steam Big Picture needs
d3d11_device_CreateDeviceContextState
Product: Wine
Version: 4.2
Hardware: x86
OS: Linux
Status: NEW
Severity: normal
Priority: P2
Component: directx-d3d
Assignee: wine-bugs(a)winehq.org
Reporter: dark.shadow4(a)web.de
Distribution: ---
Split from bug 44120.
Big picture currently errors with
> Assertion Failed: No D2D device created, possible no GPU supporting D3D10_FEATURE_LEVEL_9_1 or higher was found? Can't create surface
The problem is fixed by adding a stub like
##########
static HRESULT STDMETHODCALLTYPE d3d11_device_CreateDeviceContextState(...)
{
*chosen_feature_level = feature_levels[0];
return S_OK;
}
##########
This makes big picture mode open, but you still have a blackscreen due to
missing d3d10 effects support. But judging from the sounds, it atleast works
instead of crashing.
--
Do not reply to this email, post in Bugzilla using the
above URL to reply.
You are receiving this mail because:
You are watching all bug changes.
https://bugs.winehq.org/show_bug.cgi?id=35539
Bug ID: 35539
Summary: Proteus 8 demo fails to install
Product: Wine
Version: 1.7.11
Hardware: x86
OS: Linux
Status: NEW
Severity: normal
Priority: P2
Component: msi
Assignee: wine-bugs(a)winehq.org
Reporter: focht(a)gmx.net
Classification: Unclassified
Hello folks,
split off from bug 34457
--- snip ---
$ WINEDEBUG=+tid,+seh,+relay,+msi wine ./prodemo.exe >>log.txt 2>&1
...
0037:trace:msi:ACTION_PerformUIAction Performing action
(L"WriteEnvironmentStrings")
...
0037:trace:msi:MSI_ProcessMessage (nil) (nil) (nil) 0 100 L"Action 13:24:18:
WriteEnvironmentStrings. Updating environment strings"
...
0037:trace:msi:MSI_DatabaseOpenViewW L"SELECT * FROM `Environment`" 0x33f7e8
...
0037:trace:msi:ITERATE_WriteEnvironmentString name L"!-*LXKSERVER" value (null)
...
0037:trace:msi:MSI_ProcessMessage (nil) (nil) (nil) 0 200 L"Name: LXKSERVER,
Value: , Action 0"
...
0037:trace:msi:ITERATE_WriteEnvironmentString name L"=-*LXKSERVER" value
L"[KEY_SERVER]"
...
0037:trace:msi:MSI_FormatRecordW L"[KEY_SERVER]"
...
0037:trace:msi:msi_get_property property L"KEY_SERVER" not found
...
0037:trace:msi:MSI_ProcessMessage (nil) (nil) (nil) 0 200 L"Name: LXKSERVER,
Value: , Action 0"
...
0037:trace:msi:MSI_ProcessMessage (nil) (nil) (nil) 0 10 L"Action ended
13:24:18: WriteEnvironmentStrings. Return value 14."
...
0037:err:msi:ITERATE_Actions Execution halted, action
L"WriteEnvironmentStrings" returned 14
--- snip ---
"Environment" msi table dump with ORCA:
--- snip ---
Environment Name Value Component_
s72 l255 L255 s72
LXKSERVER !-*LXKSERVER APPFRAME.DLL
LXKSERVER_1 =-*LXKSERVER [KEY_SERVER] APPFRAME.DLL
--- snip ---
The first one has no value -> skipped (ok).
The second one has a value and is getting deformatted ... unfortunately
'KEY_SERVER' property is not set at this point, resulting in failure.
I found only one occurrence of this property 'KEY_SERVER' in msi tables:
"Control" msi table:
--- snip ---
KeyServerDlg Edit_1 Edit 101 112 125 18 3 KEY_SERVER
{260} Bitmap
--- snip ---
The unattended install using explicit command line property works, see:
http://www.softnual.com/html/pds/network-installation.htm
--- quote ---
Where a server license and dongle are installed the KEY_SERVER property can be
set on the command line to point to the licence key server. If set this will
set the environment variable, if not set the variable will be cleared.
--- quote ---
If I pass the property via command line it finishes successfully:
--- snip ---
$ wine msiexec -i setup_demo8.1.17358.0.msi KEY_SERVER=test
...
$ fixme:wshom:WshShell3_RegWrite
(L"HKLM\\SYSTEM\\CurrentControlSet\\Control\\Session
Manager\\Environment\\LXKSERVER" {VT_BSTR: L"test"} {vt 10}): stub
--- snip ---
For UI install, the 'KeyServerDlg' is referenced from 'LicenseKeyTypeDlg' which
is referenced from 'LicenseAgreementDlg':
--- snip ---
LicenseAgreementDlg Back NewDialog WelcomeDlg AI_INSTALL AND
LicenseAgreementDlg_Cond 1
LicenseAgreementDlg Next NewDialog SetupTypeDlg AI_INSTALL AND
LicenseAgreementDlg_Cond 3
LicenseAgreementDlg Next NewDialog LicenseKeyTypeDlgAI_INSTALL
AND LicenseAgreementDlg_Cond AND LicenseKeyTypeDlg_Cond 4
LicenseAgreementDlg Next [LicenseKeyTypeDlg_Cond] 1 Family <>
"Demonstration" 2
LicenseAgreementDlg Next [LicenseKeyTypeDlg_Cond] {} 1 1
LicenseAgreementDlg Cancel SpawnDialog CancelDlg 1 100
LicenseAgreementDlg PrintButton DoAction AI_PrintRtf 1 2
LicenseAgreementDlg PrintButton [AI_PRINT_RTF]
LicenseAgreementDlg#AgreementText 1 1
--- snip ---
'SetupTypeDlg' is selected for 'next' button instead of 'LicenseKeyTypeDlg':
--- snip ---
0037:trace:msi:msi_set_property 0x1437c0 L"LicenseAgreementDlg_Cond" L"1" -1
...
0037:trace:msi:MSI_EvaluateConditionW 1 <- L"AI_INSTALL AND
LicenseAgreementDlg_Cond"
...
0037:trace:msi:msi_dialog_send_event Sending control event L"NewDialog"
L"LicenseAgreementDlg"
...
0037:trace:msi:MSI_EvaluateConditionW L"AI_INSTALL AND LicenseAgreementDlg_Cond
AND LicenseKeyTypeDlg_Cond"
...
0037:trace:msi:msi_get_property returning L"1" for property L"AI_INSTALL"
...
0037:trace:msi:msi_get_property returning L"1" for property
L"LicenseAgreementDlg_Cond"
...
0037:trace:msi:msi_get_property property L"LicenseKeyTypeDlg_Cond" not found
...
0037:trace:msi:MSI_EvaluateConditionW 0 <- L"AI_INSTALL AND
LicenseAgreementDlg_Cond AND LicenseKeyTypeDlg_Cond"
...
0037:trace:msi:MSI_EvaluateConditionW 1 <- L"AI_INSTALL AND
LicenseAgreementDlg_Cond"
0037:trace:msi:msi_dialog_send_event Sending control event L"NewDialog"
L"SetupTypeDlg"
--- snip ---
'LicenseKeyTypeDlg_Cond' is tied to control 'Event':
--- snip ---
LicenseAgreementDlg Next [LicenseKeyTypeDlg_Cond] 1 Family <>
"Demonstration" 2
LicenseAgreementDlg Next [LicenseKeyTypeDlg_Cond] {} 1 1
--- snip ---
The event condition:
--- snip ---
0037:trace:msi:MSI_DatabaseOpenViewW L"SELECT * FROM ControlEvent WHERE
`Dialog_` = 'LicenseAgreementDlg' AND `Control_` = 'Next' ORDER BY `Ordering`"
0x33f240
...
0037:trace:msi:MSI_EvaluateConditionW L"1"
...
0037:trace:msi:COND_GetString Got identifier L"1"
...
0037:trace:msi:MSI_EvaluateConditionW 1 <- L"1"
...
0037:trace:msi:msi_set_property 0x1437c0 L"LicenseKeyTypeDlg_Cond" (null) -1
...
0037:trace:msi:msi_get_property property L"LicenseKeyTypeDlg_Cond" not found
0037:trace:msi:MSI_DatabaseOpenViewW L"DELETE FROM `_Property` WHERE
`_Property` = 'LicenseKeyTypeDlg_Cond'" 0x33f11c
...
0037:trace:msi:MSI_EvaluateConditionW L"Family <> \"Demonstration\""
...
0037:trace:msi:COND_GetString Got identifier L"Family"
...
0037:trace:msi:msi_get_property returning (null) for property L"Family"
...
0037:trace:msi:msi_get_property returning L"Demonstration" for property
L"Family"
...
0037:trace:msi:COND_GetLiteral Got literal L"Demonstration"
...
0037:trace:msi:MSI_EvaluateConditionW 0 <- L"Family <> \"Demonstration\""
...
--- snip ---
'Family' property is hard coded by default to 'Demonstration' value.
Makes sense for demo app/installer.
Summing it up: at first glance everything looks ok.
Maybe it's another MSI client vs. server issue.
$ sha1sum prodemo.exe
e3409adbc80bd73a36f82890da2b7d16be2fbf51 prodemo.exe
$ du -sh prodemo.exe
166M prodemo.exe
$ wine --version
wine-1.7.11-306-g8f289c8
Regards
--
Do not reply to this email, post in Bugzilla using the
above URL to reply.
You are receiving this mail because:
You are watching all bug changes.
http://bugs.winehq.org/show_bug.cgi?id=36010
Bug ID: 36010
Summary: Changing font resolution on winecfg changes default
main font to Tahoma
Product: Wine
Version: unspecified
Hardware: x86
OS: Linux
Status: UNCONFIRMED
Severity: normal
Priority: P2
Component: -unknown
Assignee: wine-bugs(a)winehq.org
Reporter: jbopen(a)gmail.com
Changing the value of font resolution under "Desktop" (winecfg) the system.reg
changes the value "MS Shell Dlg" to the original "Tahoma".
--
Do not reply to this email, post in Bugzilla using the
above URL to reply.
You are receiving this mail because:
You are watching all bug changes.
http://bugs.winehq.org/show_bug.cgi?id=32749
Bug #: 32749
Summary: Implement atl100.dll.AtlAxDialogBoxW to show error
dialogs (Visual Studio 2010 (10.0) Express Edition)
Product: Wine
Version: 1.5.21
Platform: x86
OS/Version: Linux
Status: NEW
Severity: normal
Priority: P2
Component: atl
AssignedTo: wine-bugs(a)winehq.org
ReportedBy: focht(a)gmx.net
Classification: Unclassified
Hello folks,
continuation of bug 32564 (Visual Studio 2010 (10.0) Express Edition needs
atl100.dll.AtlAxDialogBoxW).
Although it's stubbed for now it might be useful to load and show the dialog
resource.
--- snip ---
0009:fixme:atl:AtlAxDialogBoxW (0x401f0000 #00cc 0x2008a 0x401b589f 0)
--- snip ---
The user doesn't know what happened in this case.
Regards
--
Configure bugmail: http://bugs.winehq.org/userprefs.cgi?tab=email
Do not reply to this email, post in Bugzilla using the
above URL to reply.
------- You are receiving this mail because: -------
You are watching all bug changes.
https://bugs.winehq.org/show_bug.cgi?id=50168
Bug ID: 50168
Summary: Error when running notepad.exe: Failed to start RpcSs
service
Product: Wine
Version: 5.22
Hardware: x86-64
OS: Linux
Status: UNCONFIRMED
Severity: normal
Priority: P2
Component: -unknown
Assignee: wine-bugs(a)winehq.org
Reporter: winehq(a)lv.net.nz
Distribution: ---
When I run `wine notepad.exe` from my `~/.wine/drive_c/windows` I get the
following error:
0060:err:ole:start_rpcss Failed to start RpcSs service
I am running Debian 10 on x86_64, and have installed winehq-devel from the
winehq repository. I've also tried using winehq-staging. I'm using a fresh
~/.wine.
The same error shows up on explorer.exe.
Interestingly, the error disappears if I run and then quit explorer.exe:
explorer.exe crashes on exit (wine: Unhandled page fault on read access to
0000000000000000 at address 0000000000409FC7 (thread 00d0)) and leaves
wineserver and a couple of winedevice.exe processes running. Happy to provide
more info on the explorer.exe crash if that helps.
--
Do not reply to this email, post in Bugzilla using the
above URL to reply.
You are receiving this mail because:
You are watching all bug changes.