Hi,
It looks like your patch introduced the new failures shown below. Please investigate and fix them before resubmitting your patch. If they are not new, fixing them anyway would help a lot. Otherwise please ask for the known failures list to be updated.
The full results can be found at: https://testbot.winehq.org/JobDetails.pl?Key=144383
Your paranoid android.
=== debian11 (build log) ===
../wine/dlls/winebus.sys/bus_udev.c:1729:13: error: assignment of read-only variable ���syspath��� ../wine/dlls/winebus.sys/bus_udev.c:1730:13: error: assignment of read-only variable ���devnode��� Task: The win32 Wine build failed
=== debian11b (build log) ===
../wine/dlls/winebus.sys/bus_udev.c:1729:13: error: assignment of read-only variable ���syspath��� ../wine/dlls/winebus.sys/bus_udev.c:1730:13: error: assignment of read-only variable ���devnode��� Task: The wow64 Wine build failed