http://bugs.winehq.com/show_bug.cgi?id=851
------- Additional Comments From jingle(a)telekbird.com.cn 2002-07-03 21:39 -------
here is the gcc version
[root@DB_DS root]# gcc -v
Reading specs from /usr/lib/gcc-lib/i386-redhat-linux/2.96/specs
gcc version 2.96 20000731 (Red Hat Linux 7.1 2.96-98)
and here is the installed gcc packages
gcc3-3.0.1-3
gcc-g77-2.96-98
gcc3-g77-3.0.1-3
gcc-chill-2.96-98
libgcc-3.0.1-3
gcc3-java-3.0.1-3
gcc-objc-2.96-98
gcc-c++-2.96-98
gcc3-objc-3.0.1-3
gcc3-c++-3.0.1-3
gcc-2.96-98
gcc-java-2.96-98
Thanx!
DO NOT REPLY TO THIS EMAIL, BUT PLEASE POST YOUR BUG
RELATED COMMENTS THROUGH THE WEB INTERFACE AVAILABLE AT
<http://bugs.winehq.com/show_bug.cgi?id=851>.
ANY REPLY MADE TO THIS MESSAGE WILL NOT BE COLLECTED AND
INSERTED IN THE BUG DATABASE.
http://bugs.winehq.com/show_bug.cgi?id=854
Summary: ld: cannot find -lgdbm on compilation
Product: Wine
Version: 20020509
Platform: PC
OS/Version: Linux
Status: NEW
Severity: major
Priority: P2
Component: wine-misc
AssignedTo: wine-bugs(a)winehq.com
ReportedBy: seasidefront(a)yahoo.fr
Dear colleague,
When I compile wine I got the following message:
Note (probably harmless): No library found for -ldbm
/usr/bin/ld: cannot find -lgdbm
collect2: ld returned 1 exit status
make[2]: *** [winetest.exe.so] Error 1
make[2]: Leaving directory `/home/ignasi/wine-20020509/programs/winetest'
make[1]: *** [winetest] Error 2
make[1]: Leaving directory `/home/ignasi/wine-20020509/programs'
make: *** [programs] Error 2
Compilation failed, aborting install.
I use Debian Potato 2.2, with the following programs:
gcc 2.95.2 2
ld 2.9.5
wine-20020411 has compiled successfully on the same machine.
If you want or I missed some more info, please tell me.
Thanks a lot for all your effort.
All the very best,
Ignasi
DO NOT REPLY TO THIS EMAIL, BUT PLEASE POST YOUR BUG
RELATED COMMENTS THROUGH THE WEB INTERFACE AVAILABLE AT
<http://bugs.winehq.com/show_bug.cgi?id=854>.
ANY REPLY MADE TO THIS MESSAGE WILL NOT BE COLLECTED AND
INSERTED IN THE BUG DATABASE.
http://bugs.winehq.com/show_bug.cgi?id=853
Summary: Terragen LCMapStringA( ... ) vs wine-20020605
Product: Wine
Version: 20020605
Platform: PC
URL: http://bowlvisions.com/
OS/Version: Linux
Status: NEW
Severity: normal
Priority: P2
Component: wine-ole
AssignedTo: wine-bugs(a)winehq.com
ReportedBy: ithaqua(a)inreach.com
CC: ithaqua(a)inreach.com
"wine Terragen.exe" throws X error: Failed to load "TreeView" ... outdated
COMCTL32.OCX ... after Terragen main window has opened. Using COMCTL32.OCX that
came with Terragen.
Console errors refer to "LCMapStringA( ... ): unimplemented", 4 times prior to
and 4 times after: Loading modules in C:\Program Files\Terragen\ etc.
No Windows partition present at runtime - on purpose - but do have the
capability to "borrow" (copy) system files & DLLs to Linux for Linux to use at
runtime. Just don't know where to put them - OR - is updated source required
for OLE or what?
Using Linux Mandrake 8.1, kernel 2.4.8-26mdk, KDE 2.2.1, freetype-2.1.2,
Xwindows 3.3.6, libGL.so.1.2, and building wine-20020605 with gcc-2.96. Not
using Xwindows 4.2.0 just yet.
NotePad.exe and WinMine.exe test apps both work fine. Thanks!
DO NOT REPLY TO THIS EMAIL, BUT PLEASE POST YOUR BUG
RELATED COMMENTS THROUGH THE WEB INTERFACE AVAILABLE AT
<http://bugs.winehq.com/show_bug.cgi?id=853>.
ANY REPLY MADE TO THIS MESSAGE WILL NOT BE COLLECTED AND
INSERTED IN THE BUG DATABASE.
http://bugs.winehq.com/show_bug.cgi?id=819
------- Additional Comments From johane(a)lysator.liu.se 2002-07-03 16:46 -------
"AppDefault" should be "AppDefaults".
DO NOT REPLY TO THIS EMAIL, BUT PLEASE POST YOUR BUG
RELATED COMMENTS THROUGH THE WEB INTERFACE AVAILABLE AT
<http://bugs.winehq.com/show_bug.cgi?id=819>.
ANY REPLY MADE TO THIS MESSAGE WILL NOT BE COLLECTED AND
INSERTED IN THE BUG DATABASE.
http://bugs.winehq.com/show_bug.cgi?id=819
------- Additional Comments From johane(a)lysator.liu.se 2002-07-03 16:44 -------
Could you complete that report a bit?
Add this to your config file, with your exe's name in place of name_of_your_exe,
and rerun.
[AppDefault\\name_of_your_exe\\Debug]
"RelayExclude" =
"RtlEnterCriticalSection;RtlLeaveCriticalSection;RtlDeleteCriticalSection;RtlFreeHeap"
DO NOT REPLY TO THIS EMAIL, BUT PLEASE POST YOUR BUG
RELATED COMMENTS THROUGH THE WEB INTERFACE AVAILABLE AT
<http://bugs.winehq.com/show_bug.cgi?id=819>.
ANY REPLY MADE TO THIS MESSAGE WILL NOT BE COLLECTED AND
INSERTED IN THE BUG DATABASE.
http://bugs.winehq.com/show_bug.cgi?id=826
jnewman(a)codeweavers.com changed:
What |Removed |Added
----------------------------------------------------------------------------
AssignedTo|jnewman(a)codeweavers.com |wine-bugs(a)winehq.com
Component|bug list |wine-misc
Product|Bugzilla |Wine
Version|unspecified |CVS
------- Additional Comments From jnewman(a)codeweavers.com 2002-07-03 11:36 -------
This is a Wine bug, NOT a bugzilla bug, please pay attention when you are
entering bugs.
DO NOT REPLY TO THIS EMAIL, BUT PLEASE POST YOUR BUG
RELATED COMMENTS THROUGH THE WEB INTERFACE AVAILABLE AT
<http://bugs.winehq.com/show_bug.cgi?id=826>.
ANY REPLY MADE TO THIS MESSAGE WILL NOT BE COLLECTED AND
INSERTED IN THE BUG DATABASE.
http://bugs.winehq.com/show_bug.cgi?id=851
------- Additional Comments From tony_lambregts(a)telusplanet.net 2002-07-03 10:29 -------
What version of gcc are you using? What is the result of gcc -v
DO NOT REPLY TO THIS EMAIL, BUT PLEASE POST YOUR BUG
RELATED COMMENTS THROUGH THE WEB INTERFACE AVAILABLE AT
<http://bugs.winehq.com/show_bug.cgi?id=851>.
ANY REPLY MADE TO THIS MESSAGE WILL NOT BE COLLECTED AND
INSERTED IN THE BUG DATABASE.
http://bugs.winehq.com/show_bug.cgi?id=852
------- Additional Comments From spetreolle(a)yahoo.fr 2002-07-03 10:14 -------
Created an attachment (id=199)
.wine/config file
DO NOT REPLY TO THIS EMAIL, BUT PLEASE POST YOUR BUG
RELATED COMMENTS THROUGH THE WEB INTERFACE AVAILABLE AT
<http://bugs.winehq.com/show_bug.cgi?id=852>.
ANY REPLY MADE TO THIS MESSAGE WILL NOT BE COLLECTED AND
INSERTED IN THE BUG DATABASE.
http://bugs.winehq.com/show_bug.cgi?id=852
Summary: winininet test doesn't terminate/fail
Product: Wine
Version: CVS
Platform: PC
OS/Version: Linux
Status: NEW
Severity: normal
Priority: P2
Component: wine-net
AssignedTo: wine-bugs(a)winehq.com
ReportedBy: spetreolle(a)yahoo.fr
running make test results in an infinite waiting process.
there is no error/warning message.
emulated system is a winme.
if configured to emulate a nt40, the test halts to debugger complaining about
write access to 0x0 (no more else error message)
I attached my .wine/config file.
DO NOT REPLY TO THIS EMAIL, BUT PLEASE POST YOUR BUG
RELATED COMMENTS THROUGH THE WEB INTERFACE AVAILABLE AT
<http://bugs.winehq.com/show_bug.cgi?id=852>.
ANY REPLY MADE TO THIS MESSAGE WILL NOT BE COLLECTED AND
INSERTED IN THE BUG DATABASE.
http://bugs.winehq.com/show_bug.cgi?id=706
spetreolle(a)yahoo.fr changed:
What |Removed |Added
----------------------------------------------------------------------------
CC| |spetreolle(a)yahoo.fr
Platform| |All
DO NOT REPLY TO THIS EMAIL, BUT PLEASE POST YOUR BUG
RELATED COMMENTS THROUGH THE WEB INTERFACE AVAILABLE AT
<http://bugs.winehq.com/show_bug.cgi?id=706>.
ANY REPLY MADE TO THIS MESSAGE WILL NOT BE COLLECTED AND
INSERTED IN THE BUG DATABASE.