http://bugs.winehq.org/show_bug.cgi?id=10048
Summary: unimplemented function imm32.dll.ImmDisableIme
Product: Wine
Version: 0.9.4.
Platform: PC
OS/Version: Linux
Status: UNCONFIRMED
Severity: enhancement
Priority: P2
Component: wine-misc
AssignedTo: wine-bugs(a)winehq.org
ReportedBy: bryan.oshea(a)minacs.com
Created an attachment (id=8595)
--> (http://bugs.winehq.org/attachment.cgi?id=8595)
Splashscreen
Trying to run program call iHEAT 8.37 client.
This is a trouble ticket system client by Frontrange solutions
(http://www.frontrage.com).
The client uses an embedded program call GoGlobal by
Graphon(http://www.graphon.com) to connect to some type of terminal server
application running on a designated server.
When i run the client i can get as far as the splash screen and then it stops
with call to unimplemented function imm32.dll.ImmDisableIme.
wine: Call from 0x7ee15c70 to unimplemented function imm32.dll.ImmDisableIme,
aborting
See attachment for screenshot.
--
Configure bugmail: http://bugs.winehq.org/userprefs.cgi?tab=email
------- You are receiving this mail because: -------
You are watching all bug changes.
http://bugs.winehq.org/show_bug.cgi?id=9747
Summary: Family Tree Maker 6, 8, 2006 constantly complain "Cannot
obtain version information for OLE2NLS.DLL"
Product: Wine
Version: 0.9.45.
Platform: Other
URL: http://familytreemaker.genealogy.com/abtffiv.html
OS/Version: other
Status: NEW
Keywords: download
Severity: enhancement
Priority: P2
Component: wine-ole
AssignedTo: wine-bugs(a)winehq.org
ReportedBy: dank(a)kegel.com
Family Tree Maker 6, 8, and 2006 all seem to require
winetricks fakeie6
to install and run, but seem to function. But
every time you click a command on the toolbar, it puts up
a dialog complaining
"Cannot obtain version information for OLE2NLS.DLL. You may need to put the
file OLE2NLS.DLL in the SYSTEM directory within your Windows directory."
and the log entry
warn:ver:VERSION_GetFileVersionInfo_16 Could not find VS_VERSION_INFO in
"c:\\windows\\system32\\OLE2NLS.DLL"
This is harmless, but gets to be real annoying.
Adding a fakedll entry in wine.inf didn't seem to help
(I don't think that works for 16 bit things anyway).
--
Configure bugmail: http://bugs.winehq.org/userprefs.cgi?tab=email
------- You are receiving this mail because: -------
You are watching all bug changes.
http://bugs.winehq.org/show_bug.cgi?id=9333
Summary: WM_LBUTTONDOWN message is not generated reliably
Product: Wine
Version: 0.9.42.
Platform: PC
OS/Version: Linux
Status: UNCONFIRMED
Severity: critical
Priority: P2
Component: wine-winelib
AssignedTo: wine-bugs(a)winehq.org
ReportedBy: ecentanni(a)lsijax.com
using wine-devel rpm package for Red Hat Enterprise Client Ver 5. Version
0.9.42. Release 1.el5. Source rpm is wine-0.9.42-1.el5.src.rpm
When clicking on the main window of the application the WM_LBUTTONDOWN message
is not generated reliably. If I change focus to another application and then
back to the subject program I may get one or two WM_LBUTTONDOWN message and
then no more.
--
Configure bugmail: http://bugs.winehq.org/userprefs.cgi?tab=email
------- You are receiving this mail because: -------
You are watching all bug changes.
http://bugs.winehq.org/show_bug.cgi?id=9337
Summary: direct 3d errors while running vietcong.exe
Product: Wine
Version: 0.9.43.
Platform: PC
URL: http://appdb.winehq.org/appview.php?iVersionId=8864
OS/Version: Linux
Status: UNCONFIRMED
Severity: major
Priority: P1
Component: wine-directx-d3d
AssignedTo: wine-bugs(a)winehq.org
ReportedBy: docmccoy80(a)freenet.de
When vietcong.exe is running by wine, I get always the same errors repeatedly:
fixme:d3d:IWineD3DSwapChainImpl_Present Unhandled present options
(nil)/0x33fcb8
fixme:d3d:IWineD3DSwapChainImpl_Present Unhandled present options
(nil)/0x33fa80
fixme:d3d:IWineD3DSwapChainImpl_Present Unhandled present options
(nil)/0x33fd0c
fixme:d3d:IWineD3DSwapChainImpl_Present Unhandled present options
(nil)/0x33df88
fixme:d3d:IWineD3DSwapChainImpl_Present Unhandled present options
(nil)/0x33df68
fixme:d3d:IWineD3DSwapChainImpl_Present Unhandled present options
(nil)/0x33df7c
fixme:d3d:IWineD3DSwapChainImpl_Present Unhandled present options
(nil)/0x33dfa0
When I start a game in Vietcong, it is loading, but then it crashs.
If I want to select the multiplayer character, it also crashs.
I think wine has problems to emulate the direct3d eninge of Vietcong.
Unfortunately I can't give a better bug report, because I don't know much about
wine/d3d/....
Perhaps I just need a dll?!
--
Configure bugmail: http://bugs.winehq.org/userprefs.cgi?tab=email
------- You are receiving this mail because: -------
You are watching all bug changes.
http://bugs.winehq.org/show_bug.cgi?id=9685
Summary: Punkbuster removes me from game for UNKNOWN WINDOWS API
FUNCTION [131124]
Product: Wine
Version: CVS/GIT
Platform: PC
URL: http://www.evenbalance.com
OS/Version: Linux
Status: UNCONFIRMED
Severity: normal
Priority: P2
Component: wine-misc
AssignedTo: wine-bugs(a)winehq.org
ReportedBy: ead1234(a)hotmail.com
Created an attachment (id=8104)
--> (http://bugs.winehq.org/attachment.cgi?id=8104)
punkbuster kick log
When playing America's Army with punkbuster enabled I am removed from the
server for UNKNOWN WINDOWS API FUNCTION [131124].
--
Configure bugmail: http://bugs.winehq.org/userprefs.cgi?tab=email
------- You are receiving this mail because: -------
You are watching all bug changes.
http://bugs.winehq.org/show_bug.cgi?id=9850
Summary: win16 test suite multiple failures
Product: Wine
Version: 0.9.46.
Platform: Other
URL: http://win16test.googlecode.com
OS/Version: other
Status: NEW
Keywords: download, source
Severity: enhancement
Priority: P2
Component: wine-misc
AssignedTo: wine-bugs(a)winehq.org
ReportedBy: dank(a)kegel.com
Jennifer Lai put together a win16 test suite
as her intern project this summer, with a little
guidance from me. The code is a combination
of win16 tests that had been posted in the past,
and backports of 32 bit wine tests.
Jennifer says the tests pass on Windows XP.
The code can be downloaded
from http://win16test.googlecode.com with svn,
and is quite easy to run; see
http://win16test.googlecode.com/svn/trunk/src/README
for instructions.
There are four or five crash failures and several lesser failures.
She has proposed patches to fix most of these at
http://win16test.googlecode.com/svn/trunk/src/patches/
I think there are mistakes in at least one of her patches,
but they're still a good starting point
We would have liked to commit the win16 tests as part
of the wine source tree, but Alexandre didn't want us to,
so we created a project at googlecode.com to host them.
I'll gladly give committer status to any serious wine
developer who wants to work on them.
--
Configure bugmail: http://bugs.winehq.org/userprefs.cgi?tab=email
------- You are receiving this mail because: -------
You are watching all bug changes.
http://bugs.winehq.org/show_bug.cgi?id=10130
Summary: Wine does not compile on x86_64
Product: Wine
Version: CVS/GIT
Platform: PC-x86-64
OS/Version: other
Status: UNCONFIRMED
Severity: normal
Priority: P2
Component: wine-ole
AssignedTo: wine-bugs(a)winehq.org
ReportedBy: garry.hurley.jr(a)gmail.com
CC: posta10100(a)yahoo.it, garry.hurley.jr(a)gmail.com
+++ This bug was initially created as a clone of Bug #4594 +++
gcc -c -I. -I. -I../include -I../include -Wall -pipe -fno-strict-aliasing
-gstabs+ -Wdeclaration-after-statement -Wpointer-arith -g -O2 -o preloader.o
preloader.c
preloader.c: In function ‘wld_mmap’:
preloader.c:259: warning: cast to pointer from integer of different size
preloader.c: In function ‘map_so_lib’:
preloader.c:680: warning: cast to pointer from integer of different size
preloader.c: In function ‘wld_start’:
preloader.c:910: warning: cast from pointer to integer of different size
preloader.c:910: warning: cast to pointer from integer of different size
{standard input}: Assembler messages:
{standard input}:434: Error: suffix or operands invalid for `push'
{standard input}:435: Error: suffix or operands invalid for `push'
{standard input}:437: Error: suffix or operands invalid for `pop'
{standard input}:438: Error: suffix or operands invalid for `pop'
{standard input}:439: Error: suffix or operands invalid for `push'
{standard input}:524: Error: suffix or operands invalid for `push'
{standard input}:524: Error: suffix or operands invalid for `mov'
{standard input}:524: Error: suffix or operands invalid for `pop'
{standard input}:927: Error: suffix or operands invalid for `push'
{standard input}:927: Error: suffix or operands invalid for `pop'
{standard input}:1016: Error: suffix or operands invalid for `push'
{standard input}:1016: Error: suffix or operands invalid for `pop'
{standard input}:1030: Error: suffix or operands invalid for `push'
{standard input}:1030: Error: suffix or operands invalid for `pop'
{standard input}:1130: Error: suffix or operands invalid for `push'
{standard input}:1130: Error: suffix or operands invalid for `mov'
{standard input}:1130: Error: suffix or operands invalid for `pop'
{standard input}:1153: Error: suffix or operands invalid for `push'
{standard input}:1153: Error: suffix or operands invalid for `pop'
{standard input}:1356: Error: suffix or operands invalid for `push'
{standard input}:1356: Error: suffix or operands invalid for `pop'
{standard input}:1550: Error: suffix or operands invalid for `push'
{standard input}:1550: Error: suffix or operands invalid for `mov'
{standard input}:1550: Error: suffix or operands invalid for `pop'
{standard input}:1585: Error: suffix or operands invalid for `push'
{standard input}:1585: Error: suffix or operands invalid for `mov'
{standard input}:1585: Error: suffix or operands invalid for `pop'
{standard input}:1668: Error: suffix or operands invalid for `push'
{standard input}:1668: Error: suffix or operands invalid for `mov'
{standard input}:1668: Error: suffix or operands invalid for `pop'
make[1]: *** [preloader.o] Error 1
make[1]: Leaving directory `/files/awjb/BUILD/wine-0.9.8-fe/loader'
make: *** [loader] Error 2
Additional information:
As I stated in bug 4594, which was ignored, the current git tree refused to
build WITHOUT using the --enable-win64 option. configure --with-x fails. Bug
is valid regardless of the --enable-win64 switch. Actual output is similar to
the following:
/usr/lib64/gcc/x86_64-slamd64-linux/4.1.2/../../../../x86_64-slamd64-linux/bin/ld:
i386:x86-64 architecture of input file `c_28606.o' is incompatible with i386
output
make[2]: *** [libwine.so.1.0] Error 1
make[2]: Leaving directory `/wine-current/wine/libs/wine'
make[1]: *** [wine] Error 2
make[1]: Leaving directory `/wine-current/wine/libs'
make: *** [libs] Error 2
This is only the last of such messages. This also occurs when doing
./configure with no options, make depend, and then make.
--
Configure bugmail: http://bugs.winehq.org/userprefs.cgi?tab=email
------- You are receiving this mail because: -------
You are watching all bug changes.