http://bugs.winehq.org/show_bug.cgi?id=18790
Summary: Default search does not include resolved bugs
Product: WineHQ Bugzilla
Version: unspecified
Platform: PC
OS/Version: Linux
Status: NEW
Keywords: download, source
Severity: enhancement
Priority: P3
Component: bugzilla-unknown
AssignedTo: wine-bugs(a)winehq.org
ReportedBy: kennybobs(a)o2.co.uk
The default search (the search box at the top of this page) does not include
closed bugs (rightly so), but it also does not include resolved bugs. This
leads to duplicates that could be avoided.
See Bug 18601 - a recent regression that is fixed by the next release, but
anyone searching for an open bug for Google Sketchup will not see it unless
they choose to run an advanced search, which some users clearly don't.
I'm sure this is a simple change to the code.
--
Configure bugmail: http://bugs.winehq.org/userprefs.cgi?tab=email
Do not reply to this email, post in Bugzilla using the
above URL to reply.
------- You are receiving this mail because: -------
You are watching all bug changes.
http://bugs.winehq.org/show_bug.cgi?id=18344
Summary: Icons disappear with mouse over them at
http://winehq.org/
Product: WineHQ.org
Version: unspecified
Platform: Other
OS/Version: other
Status: UNCONFIRMED
Severity: minor
Priority: P2
Component: www-unknown
AssignedTo: wine-bugs(a)winehq.org
ReportedBy: dar32ster(a)gmail.com
When standing over the icons at http://winehq.org/ with the mouse the icons
take time to download and it seems like they are disappearing. You should
download the icons on loading to make this problem disappear.
--
Configure bugmail: http://bugs.winehq.org/userprefs.cgi?tab=email
Do not reply to this email, post in Bugzilla using the
above URL to reply.
------- You are receiving this mail because: -------
You are watching all bug changes.
http://bugs.winehq.org/show_bug.cgi?id=12091
Summary: out of place text on bugzilla component description page
Product: WineHQ Bugzilla
Version: unspecified
Platform: Other
OS/Version: other
Status: NEW
Severity: trivial
Priority: P2
Component: bugzilla-unknown
AssignedTo: wine-bugs(a)winehq.org
ReportedBy: thestig(a)google.com
I can't seem to find the change for this in bugzilla.git...
On http://bugs.winehq.org/enter_bug.cgi, someone added the text:
<-- You probably want to use that link there!
Wine bugs. Submit bugs related to Wine here.
<-- Use this if in doubt!
but it also appears on this page:
http://bugs.winehq.org/describecomponents.cgi?product=Wine
which doesn't make any sense.
--
Configure bugmail: http://bugs.winehq.org/userprefs.cgi?tab=email
Do not reply to this email, post in Bugzilla using the
above URL to reply.
------- You are receiving this mail because: -------
You are watching all bug changes.
http://bugs.winehq.org/show_bug.cgi?id=11787
Summary: Set mime type for log files are text/plain
Product: WineHQ Bugzilla
Version: unspecified
Platform: Other
OS/Version: other
Status: NEW
Severity: minor
Priority: P2
Component: bugzilla-unknown
AssignedTo: wine-bugs(a)winehq.org
ReportedBy: thestig(a)google.com
Right now whenever someone attaches a .log file, Bugzilla auto-detects the mime
type as text/x-log. Many web browsers are set to download files with that mime
type, rather than just opening the file in the web browser. This is rather
annoying.
Can we change the mime types for .log files to text/plain instead? I believe
the code is in Bugzilla/Attachment.pm.
--
Configure bugmail: http://bugs.winehq.org/userprefs.cgi?tab=email
Do not reply to this email, post in Bugzilla using the
above URL to reply.
------- You are receiving this mail because: -------
You are watching all bug changes.
http://bugs.winehq.org/show_bug.cgi?id=19589
Summary: Symantec LiveUpdate 1.5.2 hangs
Product: Wine
Version: 1.1.25
Platform: PC
OS/Version: Linux
Status: NEW
Severity: normal
Priority: P2
Component: -unknown
AssignedTo: wine-bugs(a)winehq.org
ReportedBy: kennybobs(a)o2.co.uk
Created an attachment (id=22843)
--> (http://bugs.winehq.org/attachment.cgi?id=22843)
Screenshot of affected stage
Symantec LiveUpdate 1.5.2 hangs after the second stage (retrieving available
update information), consuming 100% CPU and has to be killed, after the first
run.
On second run it hangs during the second stage.
This is the entire console output in both cases:
fixme:tapi:lineInitialize (0xa939e4, 0x330000, 0x354c26, "LiveUpdate",
0xa939e0): stub.
fixme:tapi:lineShutdown ((nil)): stub.
Same in latest git.
Unfortunately I can not find a download of this version, it is on a NAV 2000
CD.
--
Configure bugmail: http://bugs.winehq.org/userprefs.cgi?tab=email
Do not reply to this email, post in Bugzilla using the
above URL to reply.
------- You are receiving this mail because: -------
You are watching all bug changes.
http://bugs.winehq.org/show_bug.cgi?id=19662
Summary: Lotus Freelance Graphics 2.1 hangs at the splash
screen
Product: Wine
Version: 1.1.27
Platform: PC
OS/Version: Linux
Status: NEW
Keywords: win16
Severity: normal
Priority: P3
Component: -unknown
AssignedTo: wine-bugs(a)winehq.org
ReportedBy: kennybobs(a)o2.co.uk
Created an attachment (id=22946)
--> (http://bugs.winehq.org/attachment.cgi?id=22946)
Wine 1.1.27 +relay +seh +tid
Lotus Freelance Graphics 2.1 hangs at the splash screen and has to be killed.
Console output:
fixme:hook:SetWindowsHookEx16 System-global hooks (3) broken in Win16
fixme:ole:OleRegisterServer16 (FLWPresentation,...): stub
fixme:toolhelp:InterruptUnRegister16 (0000), stub.
--
Configure bugmail: http://bugs.winehq.org/userprefs.cgi?tab=email
Do not reply to this email, post in Bugzilla using the
above URL to reply.
------- You are receiving this mail because: -------
You are watching all bug changes.
http://bugs.winehq.org/show_bug.cgi?id=19967
Summary: Oblivion: overflow(?) in quartz if compiled without
mpg123
Product: Wine
Version: 1.1.29
Platform: PC
OS/Version: Linux
Status: UNCONFIRMED
Severity: normal
Priority: P2
Component: quartz
AssignedTo: wine-bugs(a)winehq.org
ReportedBy: roothorick(a)new.rr.com
Compile wine without mpg123, start Oblivion, start a game, wait a certain
constant amount of time after the game starts -> crash. Based on the behavior,
I'm guessing it's a page fault. winedbg says:
First chance exception: page fault on read access to 0x00000000 in 32-bit code
(0x7bf9630a).
Register dump:
CS:0023 SS:002b DS:002b ES:002b FS:0063 GS:006b
EIP:7bf9630a ESP:0033e9f4 EBP:0033ea1c EFLAGS:00010202( R- -- I - - - )
EAX:00000000 EBX:7bfbdff4 ECX:6f517ef0 EDX:00000000
ESI:6f5184f8 EDI:6f5184f8
Stack dump:
0x0033e9f4: 6f517ef0 ffffffff 0033ea2c 7bf949b9
0x0033ea04: 00000000 6f517ea8 7bf962db 7bfbdff4
0x0033ea14: 00000000 6f5184f8 0033ea5c 7bf937f9
0x0033ea24: 6f5184f8 ffffffff 0033ea4c 7bf9625e
0x0033ea34: 6f517b34 6f5186b4 6f517ee8 7ef8bdf6
0x0033ea44: 00110058 00000000 00000000 7bfbdff4
Backtrace:
=>0 0x7bf9630a PullPin_Disconnect+0x3a() in quartz (0x0033ea1c)
1 0x7bf937f9 Parser_PullPin_Disconnect+0x139() in quartz (0x0033ea5c)
2 0x7bf732cc FilterGraph2_RemoveFilter+0x1cc() in quartz (0x0033ebcc)
3 0x7bf7715e FilterGraph2_Render+0x53e() in quartz (0x0033ee1c)
4 0x7bf72e60 FilterGraph2_RenderFile+0x1b0() in quartz (0x0033ee7c)
5 0x006acf86 in oblivion (+0x2acf86) (0x00000000)
0x7bf9630a PullPin_Disconnect+0x3a in quartz: movl 0x0(%eax),%edx
--
Configure bugmail: http://bugs.winehq.org/userprefs.cgi?tab=email
Do not reply to this email, post in Bugzilla using the
above URL to reply.
------- You are receiving this mail because: -------
You are watching all bug changes.
http://bugs.winehq.org/show_bug.cgi?id=10130
Summary: Wine does not compile on x86_64
Product: Wine
Version: CVS/GIT
Platform: PC-x86-64
OS/Version: other
Status: UNCONFIRMED
Severity: normal
Priority: P2
Component: wine-ole
AssignedTo: wine-bugs(a)winehq.org
ReportedBy: garry.hurley.jr(a)gmail.com
CC: posta10100(a)yahoo.it, garry.hurley.jr(a)gmail.com
+++ This bug was initially created as a clone of Bug #4594 +++
gcc -c -I. -I. -I../include -I../include -Wall -pipe -fno-strict-aliasing
-gstabs+ -Wdeclaration-after-statement -Wpointer-arith -g -O2 -o preloader.o
preloader.c
preloader.c: In function ‘wld_mmap’:
preloader.c:259: warning: cast to pointer from integer of different size
preloader.c: In function ‘map_so_lib’:
preloader.c:680: warning: cast to pointer from integer of different size
preloader.c: In function ‘wld_start’:
preloader.c:910: warning: cast from pointer to integer of different size
preloader.c:910: warning: cast to pointer from integer of different size
{standard input}: Assembler messages:
{standard input}:434: Error: suffix or operands invalid for `push'
{standard input}:435: Error: suffix or operands invalid for `push'
{standard input}:437: Error: suffix or operands invalid for `pop'
{standard input}:438: Error: suffix or operands invalid for `pop'
{standard input}:439: Error: suffix or operands invalid for `push'
{standard input}:524: Error: suffix or operands invalid for `push'
{standard input}:524: Error: suffix or operands invalid for `mov'
{standard input}:524: Error: suffix or operands invalid for `pop'
{standard input}:927: Error: suffix or operands invalid for `push'
{standard input}:927: Error: suffix or operands invalid for `pop'
{standard input}:1016: Error: suffix or operands invalid for `push'
{standard input}:1016: Error: suffix or operands invalid for `pop'
{standard input}:1030: Error: suffix or operands invalid for `push'
{standard input}:1030: Error: suffix or operands invalid for `pop'
{standard input}:1130: Error: suffix or operands invalid for `push'
{standard input}:1130: Error: suffix or operands invalid for `mov'
{standard input}:1130: Error: suffix or operands invalid for `pop'
{standard input}:1153: Error: suffix or operands invalid for `push'
{standard input}:1153: Error: suffix or operands invalid for `pop'
{standard input}:1356: Error: suffix or operands invalid for `push'
{standard input}:1356: Error: suffix or operands invalid for `pop'
{standard input}:1550: Error: suffix or operands invalid for `push'
{standard input}:1550: Error: suffix or operands invalid for `mov'
{standard input}:1550: Error: suffix or operands invalid for `pop'
{standard input}:1585: Error: suffix or operands invalid for `push'
{standard input}:1585: Error: suffix or operands invalid for `mov'
{standard input}:1585: Error: suffix or operands invalid for `pop'
{standard input}:1668: Error: suffix or operands invalid for `push'
{standard input}:1668: Error: suffix or operands invalid for `mov'
{standard input}:1668: Error: suffix or operands invalid for `pop'
make[1]: *** [preloader.o] Error 1
make[1]: Leaving directory `/files/awjb/BUILD/wine-0.9.8-fe/loader'
make: *** [loader] Error 2
Additional information:
As I stated in bug 4594, which was ignored, the current git tree refused to
build WITHOUT using the --enable-win64 option. configure --with-x fails. Bug
is valid regardless of the --enable-win64 switch. Actual output is similar to
the following:
/usr/lib64/gcc/x86_64-slamd64-linux/4.1.2/../../../../x86_64-slamd64-linux/bin/ld:
i386:x86-64 architecture of input file `c_28606.o' is incompatible with i386
output
make[2]: *** [libwine.so.1.0] Error 1
make[2]: Leaving directory `/wine-current/wine/libs/wine'
make[1]: *** [wine] Error 2
make[1]: Leaving directory `/wine-current/wine/libs'
make: *** [libs] Error 2
This is only the last of such messages. This also occurs when doing
./configure with no options, make depend, and then make.
--
Configure bugmail: http://bugs.winehq.org/userprefs.cgi?tab=email
------- You are receiving this mail because: -------
You are watching all bug changes.
http://bugs.winehq.org/show_bug.cgi?id=19297
Summary: MS Office Access Runtime 2007 don't work
Product: Wine
Version: 1.1.25
Platform: PC
OS/Version: Linux
Status: UNCONFIRMED
Severity: normal
Priority: P2
Component: -unknown
AssignedTo: wine-bugs(a)winehq.org
ReportedBy: js-box(a)nm.ru
CC: js-box(a)nm.ru
MS Office Access Runtime 2007 don't work
--
Configure bugmail: http://bugs.winehq.org/userprefs.cgi?tab=email
Do not reply to this email, post in Bugzilla using the
above URL to reply.
------- You are receiving this mail because: -------
You are watching all bug changes.