https://bugs.winehq.org/show_bug.cgi?id=42171
Bug ID: 42171
Summary: IrfanView's 4.44 Help -> About window has wrong
placement for textboxes
Product: Wine
Version: 2.0-rc4
Hardware: x86
OS: Linux
Status: UNCONFIRMED
Severity: normal
Priority: P2
Component: gdi32
Assignee: wine-bugs(a)winehq.org
Reporter: dark.shadow4(a)web.de
Distribution: ArchLinux
Created attachment 56775
--> https://bugs.winehq.org/attachment.cgi?id=56775
Wrong placement of labels
Note: Split of and blocked by 6682, only works with patches not yet in wine.
https://source.winehq.org/patches/data/128612https://source.winehq.org/patches/data/128613
The textboxes in irfanviews about dialog overlap the image.
The issue is somehow related to Bug 41639.
If my lib32-freetype2 is up to date with version 2.7, the font is ugly, but it
renders fine. If downgraded, the font is fine, but the placement is wrong.
I can submit a testcase for that, but which font can I rely on? Wine doesn't
have all fonts after all. Tahoma maybe?
--
Do not reply to this email, post in Bugzilla using the
above URL to reply.
You are receiving this mail because:
You are watching all bug changes.
http://bugs.winehq.org/show_bug.cgi?id=10893
Summary: Guildwars Minimize Bug
Product: Wine
Version: 0.9.51.
Platform: PC-x86-64
OS/Version: Linux
Status: UNCONFIRMED
Severity: normal
Priority: P4
Component: wine-directx-dshow
AssignedTo: wine-bugs(a)winehq.org
ReportedBy: core1993(a)web.de
Hello and a good day.
I have a Problem on Guildwars: If i minimize the Guildwars Window it will be
minimized. Ok, thats what i wanted. But if i resize the window the window will
have be a size of 32 * 32 Pixel. Thats sad :(
Its not so much requed because i will not minimize Guildwars often but
sometimes. And if i farm and i cant see anything thats nod fine.
I hope that you will fix this bug asap ( as soon as possible ).
Thank you. Asmar from Germany
--
Configure bugmail: http://bugs.winehq.org/userprefs.cgi?tab=email
------- You are receiving this mail because: -------
You are watching all bug changes.
https://bugs.winehq.org/show_bug.cgi?id=38478
Bug ID: 38478
Summary: Captvty crashes at start
Product: Wine
Version: 1.7.38
Hardware: x86
OS: Linux
Status: UNCONFIRMED
Severity: normal
Priority: P2
Component: mscoree
Assignee: wine-bugs(a)winehq.org
Reporter: jeremielapuree(a)yahoo.fr
Distribution: ---
Extracting captvty works well. But when one wants to start the software, it
crashes immediately. The backtrace is quite short. So I copy it instead of
attaching it.
~/captvty$ wine Captvty.exe
fixme:mscoree:parse_supported_runtime
sku=L".NETFramework,Version=v4.0,Profile=Client" not implemented
fixme:mscoree:ConfigFileHandler_startElement Unknown element
L"loadFromRemoteSources" in state 4
Unhandled Exception:
System.InvalidOperationException: WinForms_SeeInnerException --->
System.TypeLoadException: A type load exception has occurred.
at (wrapper managed-to-native) System.Reflection.MonoCMethod:InternalInvoke
(System.Reflection.MonoCMethod,object,object[],System.Exception&)
at System.Reflection.MonoCMethod.InternalInvoke (System.Object obj,
System.Object[] parameters) [0x00000] in <filename unknown>:0
--- End of inner exception stack trace ---
at ÔÇëÔÇÇ+.[Main] (Captvty.Main ) [0x00000] in <filename unknown>:0
at ÔÇëÔÇÇ+. () [0x00000] in <filename unknown>:0
at ÔÇëÔÇÇ.OnCreateMainForm () [0x00000] in <filename unknown>:0
at
Microsoft.VisualBasic.ApplicationServices.WindowsFormsApplicationBase.OnRun ()
[0x00000] in <filename unknown>:0
at Microsoft.VisualBasic.ApplicationServices.WindowsFormsApplicationBase.Run
(System.String[] commandLine) [0x00000] in <filename unknown>:0
at ÔÇëÔÇÇ. (System.String[] ) [0x00000] in <filename unknown>:0
[ERROR] FATAL UNHANDLED EXCEPTION: System.InvalidOperationException:
WinForms_SeeInnerException ---> System.TypeLoadException: A type load exception
has occurred.
at (wrapper managed-to-native) System.Reflection.MonoCMethod:InternalInvoke
(System.Reflection.MonoCMethod,object,object[],System.Exception&)
at System.Reflection.MonoCMethod.InternalInvoke (System.Object obj,
System.Object[] parameters) [0x00000] in <filename unknown>:0
--- End of inner exception stack trace ---
at ÔÇëÔÇÇ+.[Main] (Captvty.Main ) [0x00000] in <filename unknown>:0
at ÔÇëÔÇÇ+. () [0x00000] in <filename unknown>:0
at ÔÇëÔÇÇ.OnCreateMainForm () [0x00000] in <filename unknown>:0
at
Microsoft.VisualBasic.ApplicationServices.WindowsFormsApplicationBase.OnRun ()
[0x00000] in <filename unknown>:0
at Microsoft.VisualBasic.ApplicationServices.WindowsFormsApplicationBase.Run
(System.String[] commandLine) [0x00000] in <filename unknown>:0
at ÔÇëÔÇÇ. (System.String[] ) [0x00000] in <filename unknown>:0
--
Do not reply to this email, post in Bugzilla using the
above URL to reply.
You are receiving this mail because:
You are watching all bug changes.
http://bugs.winehq.org/show_bug.cgi?id=23464
Summary: Installer windows for several Disney Interactive
products do not render correctly
Product: Wine
Version: 1.2-rc5
Platform: x86
OS/Version: Linux
Status: UNCONFIRMED
Severity: trivial
Priority: P2
Component: -unknown
AssignedTo: wine-bugs(a)winehq.org
ReportedBy: markk(a)clara.co.uk
This bug report applies to at least three Disney Interactive products from the
years 1999 and 2000: Dinosaur Activity Centre, Magic Artist Studio and Toy
Story 2 Action Game.
On starting Setup.exe from the game CD, the initial window is not rendered
properly. It mainly consists of a grey background; the only part which is
rendered properly is the "sparkling" Disney logo. If you move the pointer over
where the buttons should be, they are drawn when the pointer passes over them.
(See the Windows screenshot to find where the hotspots are.)
With Wine *not* in virtual desktop mode, if you drag the window or activate
another window, it refreshes/renders correctly. (In virtual desktop mode the
window has no decorations, so cannot be dragged.)
After the window has refreshed, if you partly cover it with another window,
then click in the Setup window to bring it to the front, the just-revealed
parts are blank. That also happens in virtual desktop mode.
I have created an archive containing only those files sufficient to allow
Setup.exe to run. You can download it from
http://rapidshare.com/files/404357546/Disney.tar.bz2.html
228740 bytes, MD5 checksum fc0b0f7926209db6b4b83ff002e79219
--
Configure bugmail: http://bugs.winehq.org/userprefs.cgi?tab=email
Do not reply to this email, post in Bugzilla using the
above URL to reply.
------- You are receiving this mail because: -------
You are watching all bug changes.
https://bugs.winehq.org/show_bug.cgi?id=49003
Bug ID: 49003
Summary: Old DX7 game "Dinosaur Worlds" crashes on start
Product: Wine
Version: 5.4
Hardware: x86
OS: Linux
Status: NEW
Severity: normal
Priority: P2
Component: -unknown
Assignee: wine-bugs(a)winehq.org
Reporter: dark.shadow4(a)web.de
Distribution: ---
Created attachment 66978
--> https://bugs.winehq.org/attachment.cgi?id=66978
Log
This is basically a recreation of the long abandoned bug 1934. I found the
program in archive.org, and the issue still remains.
As soon as it starts, it crashes.
Fair warning: It switches to super low resolution which won't be reset on
crash, so enable the virtual desktop in winecfg.
--
Do not reply to this email, post in Bugzilla using the
above URL to reply.
You are receiving this mail because:
You are watching all bug changes.
https://bugs.winehq.org/show_bug.cgi?id=48501
Bug ID: 48501
Summary: U.S. Naval Observatory MICA2 software has annoying
error message upon closing
Product: Wine
Version: 5.0
Hardware: x86
OS: Linux
Status: UNCONFIRMED
Severity: normal
Priority: P2
Component: -unknown
Assignee: wine-bugs(a)winehq.org
Reporter: distroastro(a)gmail.com
Distribution: ---
Created attachment 66295
--> https://bugs.winehq.org/attachment.cgi?id=66295
The backtrace.txt file generated by Wine.
The program "U.S. Naval Observatory - Multiyear Interactive Computer Almanac
(MICA) 1800-2050" has an annoying issue that says:
"The program MICA2.exe has encountered a serious problem and needs to close. We
are sorry for the inconvenience."
Note: This message did not appear in Wine 1.8. (though I have not tested it in
versions of Wine between 1.8 and 5.0)
--
Do not reply to this email, post in Bugzilla using the
above URL to reply.
You are receiving this mail because:
You are watching all bug changes.
https://bugs.winehq.org/show_bug.cgi?id=50398
Bug ID: 50398
Summary: Microsoft Office XP 2002 installer shows "Error 25504.
Failed to set Feature xyz to the install state of
Feature xyz for mode 2." message boxes since Wine 2.12
Product: Wine
Version: 2.12
Hardware: x86-64
OS: Linux
Status: NEW
Severity: normal
Priority: P2
Component: msi
Assignee: wine-bugs(a)winehq.org
Reporter: focht(a)gmx.net
Distribution: ---
Hello folks,
while checking bug 5163 ("Microsoft Office XP 2002 installer reports error
25003 (installation source corrupted), custom action 'CADpc' returns 1603")
I've noticed a bunch of message boxes during installation which didn't appear
with earlier Wine releases.
They can be dismissed so the installer proceeds further. Alternatively the
installer can be run in "no UI" mode (pass '/q' or '/qn').
Wine 2.11 (ok):
--- snip ---
$ WINEDEBUG=+msgbox wine ./SETUP.EXE
...
err:msi:ITERATE_Actions Execution halted, action L"CADpc" returned 1603
err:msi:ITERATE_Actions Execution halted, action L"ExecuteAction" returned 1603
--- snip ---
Wine 2.12:
--- snip ---
$ WINEDEBUG=+msgbox wine ./SETUP.EXE
...
trace:msgbox:MSGBOX_OnInit L"1: 2: SpeechHidden 3: SpeechFiles 4: "
trace:msgbox:MSGBOX_OnInit L"1: 2: SpeechHidden 3: ExcelTTS 4: "
trace:msgbox:MSGBOX_OnInit L"1: 2: TranslationHidden 3: TranslationFiles_3082
4: "
trace:msgbox:MSGBOX_OnInit L"1: 2: TranslationHidden 3: TranslationFiles_1036
4: "
trace:msgbox:MSGBOX_OnInit L"1: 2: OutlookCDO 3: OutlookAddressBookControl 4:
"
trace:msgbox:MSGBOX_OnInit L"1: "
err:msi:ITERATE_Actions Execution halted, action L"CADpc" returned 1603
err:msi:ITERATE_Actions Execution halted, action L"ExecuteAction" returned 1603
--- snip ---
Wine 2.13:
--- snip ---
$ WINEDEBUG=+msgbox wine ./SETUP.EXE
...
trace:msgbox:MSGBOX_OnInit L"The installer has encountered an unexpected error
installing this package. This may indicate a problem with this package. The
error code is 25504. "
trace:msgbox:MSGBOX_OnInit L"The installer has encountered an unexpected error
installing this package. This may indicate a problem with this package. The
error code is 25504. "
trace:msgbox:MSGBOX_OnInit L"The installer has encountered an unexpected error
installing this package. This may indicate a problem with this package. The
error code is 25504. "
trace:msgbox:MSGBOX_OnInit L"The installer has encountered an unexpected error
installing this package. This may indicate a problem with this package. The
error code is 25504. "
trace:msgbox:MSGBOX_OnInit L"The installer has encountered an unexpected error
installing this package. This may indicate a problem with this package. The
error code is 25504. "
trace:msgbox:MSGBOX_OnInit L"The installer has encountered an unexpected error
installing this package. This may indicate a problem with this package. The
error code is 25003. "
err:msi:ITERATE_Actions Execution halted, action L"CADpc" returned 1603
err:msi:ITERATE_Actions Execution halted, action L"ExecuteAction" returned 1603
--- snip ---
Wine 2.15 to Wine 6.0-rc3:
--- snip ---
$ WINEDEBUG=+msgbox wine ./SETUP.EXE
...
trace:msgbox:MSGBOX_OnInit L"Error 25504. Failed to set Feature SpeechHidden to
the install state of Feature SpeechFiles for mode 2."
trace:msgbox:MSGBOX_OnInit L"Error 25504. Failed to set Feature SpeechHidden to
the install state of Feature ExcelTTS for mode 2."
trace:msgbox:MSGBOX_OnInit L"Error 25504. Failed to set Feature
TranslationHidden to the install state of Feature TranslationFiles_3082 for
mode 2."
trace:msgbox:MSGBOX_OnInit L"Error 25504. Failed to set Feature
TranslationHidden to the install state of Feature TranslationFiles_1036 for
mode 2."
trace:msgbox:MSGBOX_OnInit L"Error 25504. Failed to set Feature OutlookCDO to
the install state of Feature OutlookAddressBookControl for mode 0."
trace:msgbox:MSGBOX_OnInit L"Error 25003. Microsoft Office setup cannot
continue because the installation source has been corrupted"
err:msi:ITERATE_Actions Execution halted, action L"CADpc" returned 1603
err:msi:ITERATE_Actions Execution halted, action L"ExecuteAction" returned 1603
--- snip ---
--- snip ---
$ WINEDEBUG=+seh,+relay,+msi wine ./SETUP.EXE >>log.txt 2>&1
...
018c:trace:msi:MsiQueryFeatureStateW L"{90110409-6000-11D3-8CFE-0050048383C9}"
L"SpeechFiles"
...
018c:trace:msi:MSI_SetFeatureStates examining feature L"SpeechFiles" (level 1
installed 2 request 1 action 1)
...
0328:Call msi.MsiGetFeatureStateA(00000001,014dfc48
"SpeechFiles",014dfc14,014dfc18) ret=35f25cb9
...
0328:Ret msi.MsiGetFeatureStateA() retval=00000000 ret=35f25cb9
0328:Call msi.MsiGetFeatureStateA(00000001,014dfc70
"SpeechHidden",014dfc1c,014dfc10) ret=35f25cd6
...
0328:Ret msi.MsiGetFeatureStateA() retval=00000000 ret=35f25cd6
...
0328:Call msi.MsiRecordSetStringA(00000006,00000000,35f41f78
"FeatureDependency: Follow: 'SpeechHidden' current state: 2, action state: 2,
using state 2") ret=35f348fa
...
0328:Call msi.MsiRecordSetStringA(00000006,00000000,35f41f78
"FeatureDependency: Lead: 'SpeechFiles' current state: 2, action state: 1,
using state 1") ret=35f348fa
...
0328:Call msi.MsiSetFeatureStateA(00000001,014dfc70 "SpeechHidden",00000001)
ret=35f25d55
...
0328:Ret msi.MsiSetFeatureStateA() retval=0000065b ret=35f25d55
...
0328:Call msi.MsiRecordSetStringA(00000006,00000000,35f41f78
"FeatureDependency: Feature 'SpeechHidden' changed state to 1") ret=35f348fa
...
0328:Call msi.MsiRecordSetInteger(00000006,00000001,000063a0) ret=35f2605d
0328:Ret msi.MsiRecordSetInteger() retval=00000000 ret=35f2605d
0328:Call msi.MsiRecordSetStringA(00000006,00000002,014dfc70 "SpeechHidden")
ret=35f26069
...
0328:Ret msi.MsiRecordSetStringA() retval=00000000 ret=35f26069
0328:Call msi.MsiRecordSetStringA(00000006,00000003,014dfc48 "SpeechFiles")
ret=35f26075
...
0328:Ret msi.MsiRecordSetStringA() retval=00000000 ret=35f26075
0328:Call msi.MsiRecordSetInteger(00000006,00000004,00000002) ret=35f2607e
0328:Ret msi.MsiRecordSetInteger() retval=00000000 ret=35f2607e
0328:Call msi.MsiProcessMessage(00000001,01000000,00000006) ret=35f26088
...
032c:trace:msi:MSI_DatabaseOpenViewW L"SELECT `Message` FROM `Error` WHERE
`Error` = 25504" 033FFB44
...
032c:Call user32.MessageBoxW(00000000,01aeb350 L"Error 25504. Failed to set
Feature SpeechHidden to the install state of Feature SpeechFiles for mode
2.",10096f4e L"Windows Installer",00000030) ret=10052d3a
--- snip ---
Installer log:
--- snip ---
...
DetectDarwin10: Detected Windows Installer version 1.1 or better; manipulating
feature defaults.
...
Action start 10:46:16: FeatureDependency.
FeatureDependency: Reset: Feature 'SpeechHidden' changed state to 2
FeatureDependency: Reset: Feature 'TranslationHidden' changed state to 2
FeatureDependency: Reset: Feature 'HandWritingHidden' changed state to 2
FeatureDependency: Follow: 'OUTLOOKNonBootFiles' current state: -1, action
state: -1, using state -1
FeatureDependency: Lead: 'OUTLOOKFiles' current state: -1, action state: -1,
using state -1
FeatureDependency: Feature 'OUTLOOKNonBootFiles' did not change state, still
using -1
FeatureDependency: Follow: 'ProductNonBootFiles' current state: -1, action
state: -1, using state -1
FeatureDependency: Lead: 'ProductFiles' current state: -1, action state: -1,
using state -1
FeatureDependency: Feature 'ProductNonBootFiles' did not change state, still
using -1
FeatureDependency: Follow: 'SpeechHidden' current state: -1, action state: 2,
using state 2
FeatureDependency: Lead: 'SpeechFiles' current state: -1, action state: -1,
using state -1
FeatureDependency: Feature 'SpeechHidden' did not change state, still using
2
FeatureDependency: Follow: 'SpeechHidden' current state: -1, action state: 2,
using state 2
FeatureDependency: Lead: 'ExcelTTS' current state: -1, action state: -1,
using state -1
FeatureDependency: Feature 'SpeechHidden' did not change state, still using
2
...
Action ended 10:46:16: FeatureDependency. Return value 1.
...
Action start 10:46:34: MigrateFeatureStates.
MigrateFeatureStates
Info 2726. An internal error has occurred. (MigrateFeatureStates
)
Action ended 10:46:35: MigrateFeatureStates. Return value 0.
...
Action start 10:47:13: FeatureDependency.
FeatureDependency: Reset: Feature 'SpeechHidden' changed state to 2
FeatureDependency: Reset: Feature 'TranslationHidden' changed state to 2
FeatureDependency: Reset: Feature 'HandWritingHidden' changed state to 2
FeatureDependency: Follow: 'OUTLOOKNonBootFiles' current state: 2, action
state: 3, using state 3
FeatureDependency: Lead: 'OUTLOOKFiles' current state: 2, action state: 3,
using state 3
FeatureDependency: Feature 'OUTLOOKNonBootFiles' did not change state, still
using 3
FeatureDependency: Follow: 'ProductNonBootFiles' current state: 2, action
state: 3, using state 3
FeatureDependency: Lead: 'ProductFiles' current state: 2, action state: 3,
using state 3
FeatureDependency: Feature 'ProductNonBootFiles' did not change state, still
using 3
FeatureDependency: Follow: 'SpeechHidden' current state: 2, action state: 2,
using state 2
FeatureDependency: Lead: 'SpeechFiles' current state: 2, action state: 1,
using state 1
FeatureDependency: Feature 'SpeechHidden' changed state to 1
...
--- snip ---
Regression testing lead to:
https://source.winehq.org/git/wine.git/commitdiff/48237e249b76f5ad883ec073e…
("msi: Add a basic internal UI implementation.")
author Zebediah Figura <z.figura12(a)gmail.com>
Thu, 6 Jul 2017 04:31:52 +0000 (23:31 -0500)
$ wine --version
wine-6.0-rc3-34-g9d7a710fc0d
Regards
--
Do not reply to this email, post in Bugzilla using the
above URL to reply.
You are receiving this mail because:
You are watching all bug changes.
https://bugs.winehq.org/show_bug.cgi?id=47036
Bug ID: 47036
Summary: Game Yuri's Revenge Work perfectly in wine-4.5-1 but
has problem in wine-4.6-1
Product: Wine
Version: unspecified
Hardware: x86-64
OS: Linux
Status: UNCONFIRMED
Severity: normal
Priority: P2
Component: -unknown
Assignee: wine-bugs(a)winehq.org
Reporter: zhoujian8585169(a)126.com
Distribution: ---
See https://bugs.archlinux.org/task/62365
Description:
Game Command & Conquer: Yuri's Revenge
(https://en.wikipedia.org/wiki/Command_%26_Conquer:_Yuri%27s_Revenge) run
perfectly in wine-4.5-1 but has problem in wine-4.6-1
Steps to reproduce:
1. sudo pacman -U /var/cache/pacman/pkg/wine-4.5-1-x86_64.pkg.tar.xz
2. WINEARCH=win32 WINEPREFIX=~/.win32 wine ~/sda4/games/yuri/yuri/YURI.EXE
run perfectly see image 1 in attach file
3. sudo pacman -U /var/cache/pacman/pkg/wine-4.6-1-x86_64.pkg.tar.xz
4. WINEARCH=win32 WINEPREFIX=~/.win32 wine ~/sda4/games/yuri/yuri/YURI.EXE
has problem see image 2.
--
Do not reply to this email, post in Bugzilla using the
above URL to reply.
You are receiving this mail because:
You are watching all bug changes.
https://bugs.winehq.org/show_bug.cgi?id=53567
Bug ID: 53567
Summary: The Medium crashes when starting new game
Product: Wine
Version: 7.15
Hardware: x86-64
OS: Linux
Status: NEW
Severity: normal
Priority: P2
Component: mfplat
Assignee: wine-bugs(a)winehq.org
Reporter: andrey.goosev(a)gmail.com
Distribution: ---
Created attachment 72939
--> https://bugs.winehq.org/attachment.cgi?id=72939
+mfplat
Starting new game immediately causes pop-up window "Pure virtual function being
called while application was running (GIsRunning == 1)."
wine-7.15-74-g4608e1e1257
--
Do not reply to this email, post in Bugzilla using the
above URL to reply.
You are receiving this mail because:
You are watching all bug changes.