https://bugs.winehq.org/show_bug.cgi?id=58004
Bug ID: 58004 Summary: build issue for clang i686 linux musl Product: Wine Version: unspecified Hardware: x86-64 OS: Linux Status: UNCONFIRMED Severity: normal Priority: P2 Component: -unknown Assignee: wine-bugs@winehq.org Reporter: euloanty@live.com Distribution: ---
lld-link: error: <root>: undefined symbol: _DllMainCRTStartup@12 lld-link: error: undefined symbol: ___wine_spec_unimplemented_stub
referenced by tmp67e172a0/kernel32-00000000.spec.o:(___wine_stub_ThunkTheTemplateHandle) referenced by tmp67e172a0/kernel32-00000000.spec.o:(___wine_stub_GDIReallyCares) referenced by tmp67e172a0/kernel32-00000000.spec.o:(___wine_stub_IsThreadId) referenced 117 more times
lld-link: error: undefined symbol: ___wine_exception_handler_page_fault
referenced by dlls/kernel32/i386-windows/atom.o:(_GlobalAddAtomA@4) referenced by dlls/kernel32/i386-windows/computername.o:(_GetComputerNameA@8) referenced by dlls/kernel32/i386-windows/resource.o:(_FindResourceExA@16)
lld-link: error: undefined symbol: ___wine_setjmpex
referenced by dlls/kernel32/i386-windows/atom.o:(_GlobalAddAtomA@4) referenced by dlls/kernel32/i386-windows/computername.o:(_GetComputerNameA@8) referenced by dlls/kernel32/i386-windows/debugger.o:(_OutputDebugStringA@4) referenced 9 more times
lld-link: error: undefined symbol: ___wine_exception_handler
referenced by dlls/kernel32/i386-windows/debugger.o:(_OutputDebugStringA@4) referenced by dlls/kernel32/i386-windows/virtual.o:(_IsBadReadPtr@8) referenced by dlls/kernel32/i386-windows/virtual.o:(_IsBadWritePtr@8) referenced 6 more times
clang: error: linker command failed with exit code 1 (use -v to see invocation) winegcc: /home/cqwrteur/toolchains/llvm/x86_64-linux-gnu/llvm/bin/clang failed make: *** [Makefile:218719: dlls/kernel32/i386-windows/kernel32.dll] Error 2 make: *** Waiting for unfinished jobs.... wine build failure