http://bugs.winehq.org/show_bug.cgi?id=9916
--- Comment #62 from Dan Kegel dank@kegel.com 2008-04-24 23:49:06 --- user32/tests/msg is still failing for me, and depending on display mode, so does either d3d9/tests/visual *or* gdi32/tests/bitmap and gdi32/tests/palette:
24 bit display: make[2]: *** [visual.ok] Error 12 make[1]: *** [d3d9/tests/__test__] Error 2 make[2]: *** [msg.ok] Error 14 make[1]: *** [user32/tests/__test__] Error 2 make: *** [dlls/__test__] Error 2
16 bit display: make[2]: *** [bitmap.ok] Error 2 make[2]: *** [palette.ok] Error 3 make[1]: *** [gdi32/tests/__test__] Error 2 make[2]: *** [msg.ok] Error 14 make[1]: *** [user32/tests/__test__] Error 2 make: *** [dlls/__test__] Error 2
msg may be too hard to fix, but how about the other three?