http://bugs.winehq.org/show_bug.cgi?id=19428
Summary: Microsoft SQL Express 2005 fails to install - Error 1627 - ERROR_FUNCTION_FAILED Product: Wine Version: 1.1.26 Platform: PC OS/Version: Linux Status: UNCONFIRMED Severity: normal Priority: P2 Component: -unknown AssignedTo: wine-bugs@winehq.org ReportedBy: yurienu.amenysta@gmail.com
Hi,
I run SQLEXPR.exe, extract files, agree with the terms, and try to install it but it fails with error 1627 : ERROR_FUNCTION_FAILED.
Thanks in advance,
http://bugs.winehq.org/show_bug.cgi?id=19428
Yurienu yurienu.amenysta@gmail.com changed:
What |Removed |Added ---------------------------------------------------------------------------- URL| |http://go.microsoft.com/fwl | |ink/?linkid=65212
http://bugs.winehq.org/show_bug.cgi?id=19428
--- Comment #1 from Nikolay Sivov bunglehead@gmail.com 2009-07-23 04:50:33 --- Attach a log please. Probably duplicate of bug 12501.
http://bugs.winehq.org/show_bug.cgi?id=19428
--- Comment #2 from Yurienu yurienu.amenysta@gmail.com 2009-07-23 04:54:36 --- Created an attachment (id=22549) --> (http://bugs.winehq.org/attachment.cgi?id=22549) Log
http://bugs.winehq.org/show_bug.cgi?id=19428
Nikolay Sivov bunglehead@gmail.com changed:
What |Removed |Added ---------------------------------------------------------------------------- Attachment #22549|application/octet-stream |text/plain mime type| |
http://bugs.winehq.org/show_bug.cgi?id=19428
--- Comment #3 from Yurienu yurienu.amenysta@gmail.com 2009-07-23 04:56:08 --- (In reply to comment #1)
Attach a log please. Probably duplicate of bug 12501.
I don't think it's a duplicate of this bug (not the same errors and not the same version of Wine). I added the log.
http://bugs.winehq.org/show_bug.cgi?id=19428
Austin English austinenglish@gmail.com changed:
What |Removed |Added ---------------------------------------------------------------------------- Depends on| |12501
--- Comment #4 from Austin English austinenglish@gmail.com 2010-09-07 15:48:29 CDT --- Does using a native mspatcha.dll help?
http://bugs.winehq.org/show_bug.cgi?id=19428
--- Comment #5 from Don Pobanz dpobanz@gmail.com 2010-12-16 13:17:28 CST --- Created an attachment (id=32516) --> (http://bugs.winehq.org/attachment.cgi?id=32516) Terminal output
The installation seems to make it farther than previously. However it fails with the error message "Failed to load SQLSpars.dll" (wine 1.3.9)
http://bugs.winehq.org/show_bug.cgi?id=19428
Don Pobanz dpobanz@gmail.com changed:
What |Removed |Added ---------------------------------------------------------------------------- CC| |dpobanz@gmail.com
--- Comment #6 from Don Pobanz dpobanz@gmail.com 2010-12-16 14:20:41 CST --- I did not get an "error 1627", though the software still does not install. It looks like this bug has been fixed and this can be closed.
Bug 12501 can be used for further issues with the install.
http://bugs.winehq.org/show_bug.cgi?id=19428
Anastasius Focht focht@gmx.net changed:
What |Removed |Added ---------------------------------------------------------------------------- Status|UNCONFIRMED |RESOLVED CC| |focht@gmx.net Resolution| |FIXED
--- Comment #7 from Anastasius Focht focht@gmx.net 2011-07-24 14:51:40 CDT --- Hello,
the original problem is gone, marking fixed. Next problem is bug 12501
$ wine --version wine-1.3.25-1-gdf65f3e
Regards
http://bugs.winehq.org/show_bug.cgi?id=19428
Alexandre Julliard julliard@winehq.org changed:
What |Removed |Added ---------------------------------------------------------------------------- Status|RESOLVED |CLOSED
--- Comment #8 from Alexandre Julliard julliard@winehq.org 2011-08-05 12:39:00 CDT --- Closing bugs fixed in 1.3.26.
http://bugs.winehq.org/show_bug.cgi?id=19428
Anastasius Focht focht@gmx.net changed:
What |Removed |Added ---------------------------------------------------------------------------- Keywords| |download, Installer
https://bugs.winehq.org/show_bug.cgi?id=19428
Anastasius Focht focht@gmx.net changed:
What |Removed |Added ---------------------------------------------------------------------------- URL|http://go.microsoft.com/fwl |https://web.archive.org/web |ink/?linkid=65212 |/20130318195510/http://down | |load.microsoft.com/download | |/6/C/7/6C7458CA-8B07-411E-9 | |E3B-0DED20512696/SQLEXPR32. | |EXE Summary|Microsoft SQL Express 2005 |Microsoft SQL Express 2005 |fails to install - Error |fails to install: |1627 - |'ACTION_InstallFiles Failed |ERROR_FUNCTION_FAILED |to extract cabinet: | |L"#SqlSupp.cab"', | |"InstallFinalize" returned | |1627