http://bugs.winehq.org/show_bug.cgi?id=1960
Summary: Bison 1.875 does not compile Product: Wine Version: unspecified Platform: Other OS/Version: Linux Status: UNCONFIRMED Severity: blocker Priority: P2 Component: wine-binary AssignedTo: wine-bugs@winehq.org ReportedBy: shaokahn@outworld.ch
System: Mandrake 9.2 Bison 1.875 Wine (tryed severals)
compiling error:
make[1]: Entering directory `/home/stefan/Documents/Downloads/wine-20030219/library' make[1]: Für das Ziel »all« ist nichts zu tun. make[1]: Leaving directory `/home/stefan/Documents/Downloads/wine-20030219/library' make[1]: Entering directory `/home/stefan/Documents/Downloads/wine-20030219/ole' make[1]: Für das Ziel »all« ist nichts zu tun. make[1]: Leaving directory `/home/stefan/Documents/Downloads/wine-20030219/ole' make[1]: Entering directory `/home/stefan/Documents/Downloads/wine-20030219/unicode' make[1]: Für das Ziel »all« ist nichts zu tun. make[1]: Leaving directory `/home/stefan/Documents/Downloads/wine-20030219/unicode' make[1]: Entering directory `/home/stefan/Documents/Downloads/wine-20030219/tools' make[2]: Entering directory `/home/stefan/Documents/Downloads/wine-20030219/tools/wpp' bison -y -ppp -d -t ./ppy.y make[2]: *** [y.tab.c] Broken pipe make[2]: Leaving directory `/home/stefan/Documents/Downloads/wine-20030219/tools/wpp' make[1]: *** [wpp] Fehler 2 make[1]: Leaving directory `/home/stefan/Documents/Downloads/wine-20030219/tools' make: *** [tools] Fehler 2
Resolve:
downgrading Bison I installed 1.35 and its working with this
Greetings