http://bugs.winehq.org/show_bug.cgi?id=3968
Summary: wine cvs compile error in unicode module c_862.o Product: Wine Version: CVS Platform: PC OS/Version: Linux Status: UNCONFIRMED Severity: normal Priority: P2 Component: wine-misc AssignedTo: wine-bugs@winehq.org ReportedBy: super-greg@gmx.de
Since yesterday wine fails to compile.
make[2]: Entering directory `/var/tmp/portage/wine-9999/work/wine/libs/unicode' i686-pc-linux-gnu-gcc -c -I. -I. -I../../include -I../../include -D__WINESRC__ -DNO_LIBWINE_PORT -DWINE_UNICODE_API="" -D_REENTRANT -fPIC -Wall -pipe -mpreferred-stack-boundary=2 -fno-strict-aliasing -gstabs+ -Wdeclaration-after-statement -Wpointer-arith -march=athlon-xp -O2 -pipe -I//usr/include/lcms -o casemap.o casemap.c i686-pc-linux-gnu-gcc -c -I. -I. -I../../include -I../../include -D__WINESRC__ -DNO_LIBWINE_PORT -DWINE_UNICODE_API="" -D_REENTRANT -fPIC -Wall -pipe -mpreferred-stack-boundary=2 -fno-strict-aliasing -gstabs+ -Wdeclaration-after-statement -Wpointer-arith -march=athlon-xp -O2 -pipe -I//usr/include/lcms -o collation.o collation.c i686-pc-linux-gnu-gcc -c -I. -I. -I../../include -I../../include -D__WINESRC__ -DNO_LIBWINE_PORT -DWINE_UNICODE_API="" -D_REENTRANT -fPIC -Wall -pipe -mpreferred-stack-boundary=2 -fno-strict-aliasing -gstabs+ -Wdeclaration-after-statement -Wpointer-arith -march=athlon-xp -O2 -pipe -I//usr/include/lcms -o compose.o compose.c i686-pc-linux-gnu-gcc -c -I. -I. -I../../include -I../../include -D__WINESRC__ -DNO_LIBWINE_PORT -DWINE_UNICODE_API="" -D_REENTRANT -fPIC -Wall -pipe -mpreferred-stack-boundary=2 -fno-strict-aliasing -gstabs+ -Wdeclaration-after-statement -Wpointer-arith -march=athlon-xp -O2 -pipe -I//usr/include/lcms -o cptable.o cptable.c i686-pc-linux-gnu-gcc -c -I. -I. -I../../include -I../../include -D__WINESRC__ -DNO_LIBWINE_PORT -DWINE_UNICODE_API="" -D_REENTRANT -fPIC -Wall -pipe -mpreferred-stack-boundary=2 -fno-strict-aliasing -gstabs+ -Wdeclaration-after-statement -Wpointer-arith -march=athlon-xp -O2 -pipe -I//usr/include/lcms -o fold.o fold.c i686-pc-linux-gnu-gcc -c -I. -I. -I../../include -I../../include -D__WINESRC__ -DNO_LIBWINE_PORT -DWINE_UNICODE_API="" -D_REENTRANT -fPIC -Wall -pipe -mpreferred-stack-boundary=2 -fno-strict-aliasing -gstabs+ -Wdeclaration-after-statement -Wpointer-arith -march=athlon-xp -O2 -pipe -I//usr/include/lcms -o mbtowc.o mbtowc.c i686-pc-linux-gnu-gcc -c -I. -I. -I../../include -I../../include -D__WINESRC__ -DNO_LIBWINE_PORT -DWINE_UNICODE_API="" -D_REENTRANT -fPIC -Wall -pipe -mpreferred-stack-boundary=2 -fno-strict-aliasing -gstabs+ -Wdeclaration-after-statement -Wpointer-arith -march=athlon-xp -O2 -pipe -I//usr/include/lcms -o sortkey.o sortkey.c i686-pc-linux-gnu-gcc -c -I. -I. -I../../include -I../../include -D__WINESRC__ -DNO_LIBWINE_PORT -DWINE_UNICODE_API="" -D_REENTRANT -fPIC -Wall -pipe -mpreferred-stack-boundary=2 -fno-strict-aliasing -gstabs+ -Wdeclaration-after-statement -Wpointer-arith -march=athlon-xp -O2 -pipe -I//usr/include/lcms -o string.o string.c i686-pc-linux-gnu-gcc -c -I. -I. -I../../include -I../../include -D__WINESRC__ -DNO_LIBWINE_PORT -DWINE_UNICODE_API="" -D_REENTRANT -fPIC -Wall -pipe -mpreferred-stack-boundary=2 -fno-strict-aliasing -gstabs+ -Wdeclaration-after-statement -Wpointer-arith -march=athlon-xp -O2 -pipe -I//usr/include/lcms -o utf8.o utf8.c i686-pc-linux-gnu-gcc -c -I. -I. -I../../include -I../../include -D__WINESRC__ -DNO_LIBWINE_PORT -DWINE_UNICODE_API="" -D_REENTRANT -fPIC -Wall -pipe -mpreferred-stack-boundary=2 -fno-strict-aliasing -gstabs+ -Wdeclaration-after-statement -Wpointer-arith -march=athlon-xp -O2 -pipe -I//usr/include/lcms -o wctomb.o wctomb.c i686-pc-linux-gnu-gcc -c -I. -I. -I../../include -I../../include -D__WINESRC__ -DNO_LIBWINE_PORT -DWINE_UNICODE_API="" -D_REENTRANT -fPIC -Wall -pipe -mpreferred-stack-boundary=2 -fno-strict-aliasing -gstabs+ -Wdeclaration-after-statement -Wpointer-arith -march=athlon-xp -O2 -pipe -I//usr/include/lcms -o wctype.o wctype.c i686-pc-linux-gnu-gcc -c -I. -I. -I../../include -I../../include -D__WINESRC__ -DNO_LIBWINE_PORT -DWINE_UNICODE_API="" -D_REENTRANT -fPIC -Wall -pipe -mpreferred-stack-boundary=2 -fno-strict-aliasing -gstabs+ -Wdeclaration-after-statement -Wpointer-arith -march=athlon-xp -O2 -pipe -I//usr/include/lcms -o c_037.o c_037.c i686-pc-linux-gnu-gcc -c -I. -I. -I../../include -I../../include -D__WINESRC__ -DNO_LIBWINE_PORT -DWINE_UNICODE_API="" -D_REENTRANT -fPIC -Wall -pipe -mpreferred-stack-boundary=2 -fno-strict-aliasing -gstabs+ -Wdeclaration-after-statement -Wpointer-arith -march=athlon-xp -O2 -pipe -I//usr/include/lcms -o c_424.o c_424.c i686-pc-linux-gnu-gcc -c -I. -I. -I../../include -I../../include -D__WINESRC__ -DNO_LIBWINE_PORT -DWINE_UNICODE_API="" -D_REENTRANT -fPIC -Wall -pipe -mpreferred-stack-boundary=2 -fno-strict-aliasing -gstabs+ -Wdeclaration-after-statement -Wpointer-arith -march=athlon-xp -O2 -pipe -I//usr/include/lcms -o c_437.o c_437.c i686-pc-linux-gnu-gcc -c -I. -I. -I../../include -I../../include -D__WINESRC__ -DNO_LIBWINE_PORT -DWINE_UNICODE_API="" -D_REENTRANT -fPIC -Wall -pipe -mpreferred-stack-boundary=2 -fno-strict-aliasing -gstabs+ -Wdeclaration-after-statement -Wpointer-arith -march=athlon-xp -O2 -pipe -I//usr/include/lcms -o c_500.o c_500.c i686-pc-linux-gnu-gcc -c -I. -I. -I../../include -I../../include -D__WINESRC__ -DNO_LIBWINE_PORT -DWINE_UNICODE_API="" -D_REENTRANT -fPIC -Wall -pipe -mpreferred-stack-boundary=2 -fno-strict-aliasing -gstabs+ -Wdeclaration-after-statement -Wpointer-arith -march=athlon-xp -O2 -pipe -I//usr/include/lcms -o c_737.o c_737.c i686-pc-linux-gnu-gcc -c -I. -I. -I../../include -I../../include -D__WINESRC__ -DNO_LIBWINE_PORT -DWINE_UNICODE_API="" -D_REENTRANT -fPIC -Wall -pipe -mpreferred-stack-boundary=2 -fno-strict-aliasing -gstabs+ -Wdeclaration-after-statement -Wpointer-arith -march=athlon-xp -O2 -pipe -I//usr/include/lcms -o c_775.o c_775.c i686-pc-linux-gnu-gcc -c -I. -I. -I../../include -I../../include -D__WINESRC__ -DNO_LIBWINE_PORT -DWINE_UNICODE_API="" -D_REENTRANT -fPIC -Wall -pipe -mpreferred-stack-boundary=2 -fno-strict-aliasing -gstabs+ -Wdeclaration-after-statement -Wpointer-arith -march=athlon-xp -O2 -pipe -I//usr/include/lcms -o c_850.o c_850.c i686-pc-linux-gnu-gcc -c -I. -I. -I../../include -I../../include -D__WINESRC__ -DNO_LIBWINE_PORT -DWINE_UNICODE_API="" -D_REENTRANT -fPIC -Wall -pipe -mpreferred-stack-boundary=2 -fno-strict-aliasing -gstabs+ -Wdeclaration-after-statement -Wpointer-arith -march=athlon-xp -O2 -pipe -I//usr/include/lcms -o c_852.o c_852.c i686-pc-linux-gnu-gcc -c -I. -I. -I../../include -I../../include -D__WINESRC__ -DNO_LIBWINE_PORT -DWINE_UNICODE_API="" -D_REENTRANT -fPIC -Wall -pipe -mpreferred-stack-boundary=2 -fno-strict-aliasing -gstabs+ -Wdeclaration-after-statement -Wpointer-arith -march=athlon-xp -O2 -pipe -I//usr/include/lcms -o c_855.o c_855.c i686-pc-linux-gnu-gcc -c -I. -I. -I../../include -I../../include -D__WINESRC__ -DNO_LIBWINE_PORT -DWINE_UNICODE_API="" -D_REENTRANT -fPIC -Wall -pipe -mpreferred-stack-boundary=2 -fno-strict-aliasing -gstabs+ -Wdeclaration-after-statement -Wpointer-arith -march=athlon-xp -O2 -pipe -I//usr/include/lcms -o c_856.o c_856.c i686-pc-linux-gnu-gcc -c -I. -I. -I../../include -I../../include -D__WINESRC__ -DNO_LIBWINE_PORT -DWINE_UNICODE_API="" -D_REENTRANT -fPIC -Wall -pipe -mpreferred-stack-boundary=2 -fno-strict-aliasing -gstabs+ -Wdeclaration-after-statement -Wpointer-arith -march=athlon-xp -O2 -pipe -I//usr/include/lcms -o c_857.o c_857.c i686-pc-linux-gnu-gcc -c -I. -I. -I../../include -I../../include -D__WINESRC__ -DNO_LIBWINE_PORT -DWINE_UNICODE_API="" -D_REENTRANT -fPIC -Wall -pipe -mpreferred-stack-boundary=2 -fno-strict-aliasing -gstabs+ -Wdeclaration-after-statement -Wpointer-arith -march=athlon-xp -O2 -pipe -I//usr/include/lcms -o c_860.o c_860.c i686-pc-linux-gnu-gcc -c -I. -I. -I../../include -I../../include -D__WINESRC__ -DNO_LIBWINE_PORT -DWINE_UNICODE_API="" -D_REENTRANT -fPIC -Wall -pipe -mpreferred-stack-boundary=2 -fno-strict-aliasing -gstabs+ -Wdeclaration-after-statement -Wpointer-arith -march=athlon-xp -O2 -pipe -I//usr/include/lcms -o c_861.o c_861.c i686-pc-linux-gnu-gcc -c -I. -I. -I../../include -I../../include -D__WINESRC__ -DNO_LIBWINE_PORT -DWINE_UNICODE_API="" -D_REENTRANT -fPIC -Wall -pipe -mpreferred-stack-boundary=2 -fno-strict-aliasing -gstabs+ -Wdeclaration-after-statement -Wpointer-arith -march=athlon-xp -O2 -pipe -I//usr/include/lcms -o c_862.o c_862.c c_862.c:637:10: warning: null character(s) ignored c_862.c:637: error: stray '\2' in program c_862.c:637:14: warning: null character(s) ignored c_862.c:637: error: stray '\180' in program c_862.c:637: error: stray '\15' in program c_862.c:637: error: stray '\251' in program c_862.c:637: error: `SF4RGn' undeclared here (not in a function) c_862.c:637: error: initializer element is not constant c_862.c:637: error: (near initialization for `uni2cp_low[4593]') c_862.c:637: error: parse error before numeric constant c_862.c:637:27: warning: null character(s) ignored c_862.c:637: error: stray '\1' in program c_862.c:637:38: warning: null character(s) ignored c_862.c:637: error: `tmp' undeclared here (not in a function) c_862.c:637: error: initializer element is not constant c_862.c:637: error: (near initialization for `uni2cp_low[4594]') c_862.c:644: error: `CorePllControl' undeclared here (not in a function) c_862.c:644: error: initializer element is not constant c_862.c:644: error: (near initialization for `uni2cp_low[4595]') c_862.c:644: error: initializer element is not constant c_862.c:644: error: (near initialization for `uni2cp_low[4596]') c_862.c:644: error: parse error before ')' token c_862.c:650: error: initializer element is not constant c_862.c:650: error: (near initialization for `uni2cp_low[4597]') c_862.c:650: error: initializer element is not constant c_862.c:650: error: (near initialization for `uni2cp_low[4598]') c_862.c:650: error: parse error before ')' token c_862.c:654: error: initializer element is not constant c_862.c:654: error: (near initialization for `uni2cp_low[4599]') c_862.c:654: error: initializer element is not constant c_862.c:654: error: (near initialization for `uni2cp_low[4600]') c_862.c:654: error: parse error before ')' token c_862.c:657: error: `PMX2_SOFTRESET_ALL' undeclared here (not in a function) c_862.c:657: error: initializer element is not constant c_862.c:657: error: (near initialization for `uni2cp_low[4601]') c_862.c:682:24: video/kyro.h: No such file or directory c_862.c:684:24: STG4000Reg.h: No such file or directory c_862.c:685:30: STG4000Interface.h: No such file or directory c_862.c:687: warning: type defaults to `int' in declaration of `STG4000REG' c_862.c:687: error: parse error before '*' token c_862.c: In function `DisableVGA': c_862.c:689: error: `u32' undeclared (first use in this function) c_862.c:689: error: (Each undeclared identifier is reported only once c_862.c:689: error: for each function it appears in.) c_862.c:689: error: parse error before "tmp" c_862.c:690: error: syntax error before "count" c_862.c:693: warning: implicit declaration of function `STG_READ_REG' c_862.c:693: error: `SoftwareReset' undeclared (first use in this function) c_862.c:694: warning: implicit declaration of function `CLEAR_BIT' c_862.c:695: warning: implicit declaration of function `STG_WRITE_REG' c_862.c:698: error: `i' undeclared (first use in this function) c_862.c:699: error: `count' undeclared (first use in this function) c_862.c:704: warning: implicit declaration of function `SET_BIT' c_862.c: At top level: c_862.c:708: warning: type defaults to `int' in declaration of `STG4000REG' c_862.c:708: error: parse error before '*' token c_862.c: In function `StopVTG': c_862.c:710: error: `u32' undeclared (first use in this function) c_862.c:710: error: parse error before "tmp" c_862.c:713: error: `DACSyncCtrl' undeclared (first use in this function) c_862.c: At top level: c_862.c:718: warning: type defaults to `int' in declaration of `STG4000REG' c_862.c:718: error: parse error before '*' token c_862.c: In function `StartVTG': c_862.c:720: error: `u32' undeclared (first use in this function) c_862.c:720: error: parse error before "tmp" c_862.c:723: error: `DACSyncCtrl' undeclared (first use in this function) c_862.c: At top level: c_862.c:729: warning: type defaults to `int' in declaration of `STG4000REG' c_862.c:729: error: parse error before '*' token c_862.c: In function `SetupVTG': c_862.c:732: error: `u32' undeclared (first use in this function) c_862.c:732: error: parse error before "tmp" c_862.c:749: error: `xRes' undeclared (first use in this function) c_862.c:749: error: `yRes' undeclared (first use in this function) c_862.c:750: error: `pTiming' undeclared (first use in this function) c_862.c:751: error: `margins' undeclared (first use in this function) c_862.c:756: error: `ulBorder' undeclared (first use in this function) c_862.c:762: error: `VBottomBorder' undeclared (first use in this function) c_862.c:762: error: `HLeftBorder' undeclared (first use in this function) c_862.c:762: error: `VTopBorder' undeclared (first use in this function) c_862.c:762: error: `HRightBorder' undeclared (first use in this function) c_862.c:765: error: `HAddrTime' undeclared (first use in this function) c_862.c:766: error: `HBackPorcStrt' undeclared (first use in this function) c_862.c:767: error: `HTotal' undeclared (first use in this function) c_862.c:768: error: `HDisplayStrt' undeclared (first use in this function) c_862.c:770: error: `HLeftBorderStrt' undeclared (first use in this function) c_862.c:771: error: `HFrontPorchStrt' undeclared (first use in this function) c_862.c:774: error: `HRightBorderStrt' undeclared (first use in this function) c_862.c:777: error: `VAddrTime' undeclared (first use in this function) c_862.c:778: error: `VBackPorchStrt' undeclared (first use in this function) c_862.c:779: error: `VTotal' undeclared (first use in this function) c_862.c:780: error: `VDisplayStrt' undeclared (first use in this function) c_862.c:782: error: `VTopBorderStrt' undeclared (first use in this function) c_862.c:783: error: `VFrontPorchStrt' undeclared (first use in this function) c_862.c:786: error: `VBottomBorderStrt' undeclared (first use in this function) c_862.c:789: error: `DACHorTim14' undeclared (first use in this function) c_862.c:789: error: stray '\3' in program c_862.c:789:35: warning: null character(s) ignored c_862.c:789:39: invalid suffix "GTS" on integer constant c_862.c:789: error: stray '\198' in program c_862.c:789: error: stray '\197' in program c_862.c:789: error: stray '\160' in program c_862.c:789: error: parse error before numeric constant c_862.c:789:50: warning: null character(s) ignored c_862.c:789: error: stray '\3' in program c_862.c:789: error: stray '\6' in program c_862.c:789:68: warning: null character(s) ignored c_862.c:789: error: stray '\3' in program c_862.c:789:73: warning: null character(s) ignored c_862.c:789:77: invalid suffix "GTS" on integer constant c_862.c:789: error: stray '\198' in program c_862.c:789: error: stray '\196' in program c_862.c:789: error: stray '\160' in program c_862.c:789:88: warning: null character(s) ignored c_862.c:789: error: stray '\211' in program c_862.c:789:94: warning: null character(s) preserved in literal c_862.c:789: error: missing terminating " character c_862.c:790:15: warning: no newline at end of file make[2]: *** [c_862.o] Error 1 make[2]: Leaving directory `/var/tmp/portage/wine-9999/work/wine/libs/unicode' make[1]: *** [unicode] Error 2 make[1]: Leaving directory `/var/tmp/portage/wine-9999/work/wine/libs' make: *** [libs] Error 2
!!! ERROR: app-emulation/wine-9999 failed. !!! Function src_compile, Line 124, Exitcode 2 !!! depend !!! If you need support, post the topmost build error, NOT this status message.
emerge info Portage 2.0.53_rc7 (default-linux/x86/2005.1, gcc-3.4.4, glibc-2.3.5-r3, 2.6.13.2-nitro1 i686) ================================================================= System uname: 2.6.13.2-nitro1 i686 AMD Athlon(tm) XP 2600+ Gentoo Base System version 1.12.0_pre10 ccache version 2.4 [enabled] dev-lang/python: 2.3.5, 2.4.2 sys-apps/sandbox: 1.2.13 sys-devel/autoconf: 2.13, 2.59-r7 sys-devel/automake: 1.4_p6, 1.5, 1.6.3, 1.7.9-r1, 1.8.5-r3, 1.9.6-r1 sys-devel/binutils: 2.16.1 sys-devel/libtool: 1.5.20-r1 virtual/os-headers: 2.6.11-r3 ACCEPT_KEYWORDS="x86 ~x86"