http://bugs.winehq.org/show_bug.cgi?id=770
------- Additional Comments From villeaak@mail.student.oulu.fi 2005-29-09 14:31 ------- This bug is not fixed.
I'm still getting this error on any InstallShield installable program I've tried, Civilization3 for example, in Wine 20050725. I can't compile 20040716 to check if this is a regression.
/* This is what I get when compiling 20040716:
In file included from /usr/include/alsa/asoundlib.h:48, from alsa.h:23, from audio_05.c:49: /usr/include/alsa/conf.h:189: error: syntax error before "struct" make[2]: *** [audio_05.o] Error 1 make[2]: Leaving directory `/usr/src/wine/WineHQ/wine-building/dlls/winmm/winealsa' make[1]: *** [winmm/winealsa] Error 2 make[1]: Leaving directory `/usr/src/wine/WineHQ/wine-building/dlls' make: *** [dlls] Error 2
*/
Should I file a new bug or should someone open this one?