(Especially the link errors I have no idea how to fix.)
Just in case somebody wants to know what the build log looks like: ------------------------------------------------------------------------------------
------ Build started: Project: winetest, Configuration: MSVC Headers Win32 ------
winetest - up-to-date.
------ Build started: Project: winmm_test, Configuration: MSVC Headers Win32 ------
winmm_test - up-to-date.
------ Build started: Project: wininet_test, Configuration: MSVC Headers Win32 ------
wininet_test - up-to-date.
------ Build started: Project: winspool_test, Configuration: MSVC Headers Win32 ------
winspool_test - up-to-date.
------ Build started: Project: ws2_32_test, Configuration: MSVC Headers Win32 ------
ws2_32_test - up-to-date.
------ Build started: Project: comctl32_test, Configuration: MSVC Headers Win32 ------
Linking... dpa.obj : error LNK2019: unresolved external symbol __imp__DPA_Search@24 referenced in function _DPA_test dpa.obj : error LNK2019: unresolved external symbol __imp__DPA_Create@4 referenced in function _DPA_test .\Output\Win32_MSVC_Headers/comctl32_test.exe : fatal error LNK1120: 2 unresolved externals
Build log was saved at "file://k:\c\Wine\wine\dlls\comctl32\tests\Output\Win32_MSVC_Headers\BuildLog.htm" comctl32_test - 3 error(s), 0 warning(s)
------ Build started: Project: user32_test, Configuration: MSVC Headers Win32 ------
user32_test - up-to-date.
------ Build started: Project: urlmon_test, Configuration: MSVC Headers Win32 ------
urlmon_test - up-to-date.
------ Build started: Project: shlwapi_test, Configuration: MSVC Headers Win32 ------
shlwapi_test - up-to-date.
------ Build started: Project: shell32_test, Configuration: MSVC Headers Win32 ------
shell32_test - up-to-date.
------ Build started: Project: rpcrt4_test, Configuration: MSVC Headers Win32 ------
rpcrt4_test - up-to-date.
------ Build started: Project: oleaut32_test, Configuration: MSVC Headers Win32 ------
Linking... olefont.obj : error LNK2019: unresolved external symbol _IFont_QueryInterface referenced in function _func_olefont .\Output\Win32_MSVC_Headers/oleaut32_test.exe : fatal error LNK1120: 1 unresolved externals
Build log was saved at "file://k:\c\Wine\wine\dlls\oleaut32\tests\Output\Win32_MSVC_Headers\BuildLog.htm" oleaut32_test - 2 error(s), 0 warning(s)
------ Build started: Project: ntdll_test, Configuration: MSVC Headers Win32 ------
Compiling... string.c string.c(33) : fatal error C1083: Cannot open include file: 'winternl.h': No such file or directory rtlstr.c rtlstr.c(28) : fatal error C1083: Cannot open include file: 'ntstatus.h': No such file or directory rtlbitmap.c rtlbitmap.c(26) : fatal error C1083: Cannot open include file: 'ntstatus.h': No such file or directory rtl.c rtl.c(27) : fatal error C1083: Cannot open include file: 'ntstatus.h': No such file or directory path.c path.c(24) : fatal error C1083: Cannot open include file: 'ntstatus.h': No such file or directory large_int.c large_int.c(27) : fatal error C1083: Cannot open include file: 'ntstatus.h': No such file or directory generated.c generated.c(14) : fatal error C1083: Cannot open include file: 'ntstatus.h': No such file or directory error.c error.c(24) : fatal error C1083: Cannot open include file: 'ntstatus.h': No such file or directory env.c env.c(24) : fatal error C1083: Cannot open include file: 'ntstatus.h': No such file or directory Generating Code...
Build log was saved at "file://k:\c\Wine\wine\dlls\ntdll\tests\Output\Win32_MSVC_Headers\BuildLog.htm" ntdll_test - 9 error(s), 0 warning(s)
------ Build started: Project: netapi32_test, Configuration: MSVC Headers Win32 ------
Compiling... wksta.c wksta.c(28) : fatal error C1083: Cannot open include file: 'ntstatus.h': No such file or directory
Build log was saved at "file://k:\c\Wine\wine\dlls\netapi32\tests\Output\Win32_MSVC_Headers\BuildLog.htm" netapi32_test - 1 error(s), 0 warning(s)
------ Build started: Project: msvcrt_test, Configuration: MSVC Headers Win32 ------
msvcrt_test - up-to-date.
------ Build started: Project: kernel32_test, Configuration: MSVC Headers Win32 ------
kernel32_test - up-to-date.
------ Build started: Project: gdi32_test, Configuration: MSVC Headers Win32 ------
gdi32_test - up-to-date.
------ Build started: Project: dsound_test, Configuration: MSVC Headers Win32 ------
Compiling... propset.c propset.c(32) : fatal error C1083: Cannot open include file: 'dsconf.h': No such file or directory
Build log was saved at "file://k:\c\Wine\wine\dlls\dsound\tests\Output\Win32_MSVC_Headers\BuildLog.htm" dsound_test - 1 error(s), 0 warning(s)
------ Build started: Project: advapi32_test, Configuration: MSVC Headers Win32 ------
advapi32_test - up-to-date.
------ Build started: Project: wineruntests, Configuration: MSVC Headers Win32 ------
wineruntests - up-to-date.
---------------------- Done ----------------------
Build: 15 succeeded, 5 failed, 0 skipped