Hi,
While running your changed tests, I think I found new failures. Being a bot and all I'm not very good at pattern recognition, so I might be wrong, but could you please double-check?
Full results can be found at: https://testbot.winehq.org/JobDetails.pl?Key=50160
Your paranoid android.
=== build (build log) ===
../../../../wine/dlls/d3dx9_36/tests/mesh.c:11084:155: error: expected ‘)’ before ‘;’ token ../../../../wine/include/wine/test.h:122:83: error: too few arguments to function ‘winetest_ok’ ../../../../wine/dlls/d3dx9_36/tests/mesh.c:11089:1: error: expected ‘;’ before ‘}’ token Makefile:422: recipe for target 'mesh.o' failed Makefile:7631: recipe for target 'dlls/d3dx9_36/tests' failed Task: The exe32 Wine crossbuild failed
=== debian9 (build log) ===
../../../../wine/dlls/d3dx9_36/tests/mesh.c:11084:155: error: expected ‘)’ before ‘;’ token ../../../../wine/include/wine/test.h:122:83: error: too few arguments to function ‘winetest_ok’ ../../../../wine/dlls/d3dx9_36/tests/mesh.c:11089:1: error: expected ‘;’ before ‘}’ token Makefile:422: recipe for target 'mesh.o' failed Makefile:8681: recipe for target 'dlls/d3dx9_36/tests' failed Task: The win32 build failed
=== debian9 (build log) ===
../../../../wine/dlls/d3dx9_36/tests/mesh.c:11084:155: error: expected ‘)’ before ‘;’ token ../../../../wine/include/wine/test.h:122:83: error: too few arguments to function ‘winetest_ok’ ../../../../wine/dlls/d3dx9_36/tests/mesh.c:11089:1: error: expected ‘;’ before ‘}’ token Makefile:422: recipe for target 'mesh.o' failed Makefile:8408: recipe for target 'dlls/d3dx9_36/tests' failed Task: The wow64 build failed