https://bugs.winehq.org/show_bug.cgi?id=57010
Bug ID: 57010
Summary: Pantheon - error during installation
Product: Wine
Version: 9.14
Hardware: x86-64
OS: Linux
Status: UNCONFIRMED
Severity: normal
Priority: P2
Component: -unknown
Assignee: wine-bugs(a)winehq.org
Reporter: winehq_bugzilla(a)yahoo.com
Distribution: ---
Created attachment 76851
--> https://bugs.winehq.org/attachment.cgi?id=76851
Console output
During the execution of the installer "PantheonSetup_182.exe", a technical
error occur.
--
Do not reply to this email, post in Bugzilla using the
above URL to reply.
You are receiving this mail because:
You are watching all bug changes.
https://bugs.winehq.org/show_bug.cgi?id=57686
Bug ID: 57686
Summary: Thief (2014) requires
'GroupMemoryBarrierWithGroupSync' support
Product: vkd3d
Version: 1.14
Hardware: x86-64
OS: Linux
Status: NEW
Severity: minor
Priority: P2
Component: hlsl
Assignee: wine-bugs(a)winehq.org
Reporter: andrey.goosev(a)gmail.com
Distribution: ---
09b4:err:d3dcompiler:D3DCompile2 Failed to compile shader, vkd3d result -4.
09b4:err:d3dcompiler:D3DCompile2 Shader log:
09b4:err:d3dcompiler:D3DCompile2
..\..\Engine\\Shaders\Compute\DoFBlurBGCS.hlsl:35:51: E5000: Invalid subscript
"Length".
09b4:err:d3dcompiler:D3DCompile2
..\..\Engine\\Shaders\Compute\DoFBlurBGCS.hlsl:35:5: E5002: Can't implicitly
convert from <error type> to int.
09b4:err:d3dcompiler:D3DCompile2
..\..\Engine\\Shaders\Compute\DoFBlurBGCS.hlsl:42:83: E5000: Invalid subscript
"Length".
09b4:err:d3dcompiler:D3DCompile2
..\..\Engine\\Shaders\Compute\DoFBlurBGCS.hlsl:43:83: E5000: Invalid subscript
"Length".
09b4:err:d3dcompiler:D3DCompile2
..\..\Engine\\Shaders\Compute\DoFBlurBGCS.hlsl:44:83: E5000: Invalid subscript
"Length".
09b4:err:d3dcompiler:D3DCompile2
..\..\Engine\\Shaders\Compute\DoFBlurBGCS.hlsl:45:83: E5000: Invalid subscript
"Length".
09b4:err:d3dcompiler:D3DCompile2
..\..\Engine\\Shaders\Compute\DoFBlurBGCS.hlsl:46:1: E5005: Function
"GroupMemoryBarrierWithGroupSync" is not defined.
09b4:err:d3dcompiler:D3DCompile2
1.14-278-ga082daeb
--
Do not reply to this email, post in Bugzilla using the
above URL to reply.
You are receiving this mail because:
You are watching all bug changes.
https://bugs.winehq.org/show_bug.cgi?id=57482
Bug ID: 57482
Summary: Total Annihilation (GOG, demo) – The game menu opens
in full screen, but the rendered part doesn’t fit the
display.
Product: Wine
Version: 9.22
Hardware: x86-64
OS: Linux
Status: UNCONFIRMED
Severity: normal
Priority: P2
Component: -unknown
Assignee: wine-bugs(a)winehq.org
Reporter: karol23145(a)gmail.com
Distribution: ---
Created attachment 77494
--> https://bugs.winehq.org/attachment.cgi?id=77494
wine_screenshot
WARNING: The GOG version of the game is broken starting from Wine version 9.17.
(Different bug.)
GAME DEMO CAN BE DOWNLOADED FROM:
https://archive.org/details/TotalAnnihilation_201405
I tested the Total Annihilation demo on the following Wine versions: 9.22,
9.22-staging, 9.0, 8.0, and 7.0.
Additionally, I tested the GOG version of Total Annihilation with the Commander
Pack on these Wine versions: 9.16 (last working version), 9.0, 8.0, and 7.0.
The bug is present in all tested versions, so it is likely not a regression.
Attaching wine and windows screen-shots.
After starting gameplay, everything works correctly, only menu is bugged.
--
Do not reply to this email, post in Bugzilla using the
above URL to reply.
You are receiving this mail because:
You are watching all bug changes.
https://bugs.winehq.org/show_bug.cgi?id=57406
Bug ID: 57406
Summary: Brothers - A Tale of Two Sons launcher fails to launch
Product: Wine
Version: 9.21
Hardware: x86-64
OS: Linux
Status: NEW
Severity: normal
Priority: P2
Component: mscoree
Assignee: wine-bugs(a)winehq.org
Reporter: andrey.goosev(a)gmail.com
Distribution: ---
Unhandled Exception:
System.MissingMethodException: Method not found: Microsoft.DirectX.Vector2
modopt(Microsoft.VisualC.IsConstModifier) Microsoft.DirectX.Vector2.get_Empty()
at BrothersLauncher.MainForm..ctor () [0x00036] in
<5ea4a82884eb4dfc8694eb83fad62bfc>:0
at (wrapper remoting-invoke-with-check) BrothersLauncher.MainForm..ctor()
at BrothersLauncher.Program.Main () [0x0000b] in
<5ea4a82884eb4dfc8694eb83fad62bfc>:0
[ERROR] FATAL UNHANDLED EXCEPTION: System.MissingMethodException: Method not
found: Microsoft.DirectX.Vector2 modopt(Microsoft.VisualC.IsConstModifier)
Microsoft.DirectX.Vector2.get_Empty()
at BrothersLauncher.MainForm..ctor () [0x00036] in
<5ea4a82884eb4dfc8694eb83fad62bfc>:0
at (wrapper remoting-invoke-with-check) BrothersLauncher.MainForm..ctor()
--
Do not reply to this email, post in Bugzilla using the
above URL to reply.
You are receiving this mail because:
You are watching all bug changes.
https://bugs.winehq.org/show_bug.cgi?id=58049
Bug ID: 58049
Summary: MFC's Menu/BeckyInternetMail: The background color of
the menu item is wrong
Product: Wine
Version: 10.4
Hardware: x86-64
OS: Linux
Status: UNCONFIRMED
Severity: normal
Priority: P2
Component: user32
Assignee: wine-bugs(a)winehq.org
Reporter: axis6404(a)proton.me
Distribution: ---
Created attachment 78304
--> https://bugs.winehq.org/attachment.cgi?id=78304
Screenshots and proposed color correction
The color of the drop-down menu in the menu bar is wrong. The color of the
outer frame and arrows is wrong.
I could not seem to fill the background with light.msstyle colors.
The correct color is the inner gray dark background color (note! Not the red
arrow part) becomes more whitish light background color (the same color as the
red arrow part).
--
Do not reply to this email, post in Bugzilla using the
above URL to reply.
You are receiving this mail because:
You are watching all bug changes.
https://bugs.winehq.org/show_bug.cgi?id=50277
Bug ID: 50277
Summary: Haven intro video does not play
Product: Wine
Version: 6.0-rc1
Hardware: x86-64
OS: Linux
Status: UNCONFIRMED
Severity: normal
Priority: P2
Component: mfplat
Assignee: wine-bugs(a)winehq.org
Reporter: kai.sterker+wine(a)gmail.com
Distribution: ---
Created attachment 68825
--> https://bugs.winehq.org/attachment.cgi?id=68825
Debug logs with +mfplat,+gstreamer
Upon testing Haven with the builtin media foundation implementation, the
following error is logged, the intro movie does not play and the game is stuck
at launch:
020c:err:mfplat:media_source_constructor Failed to play source, error 0.
0218:err:mfplat:bus_watch qtdemux0: Internal data stream error.
0218:err:mfplat:bus_watch qtdemux.c(6605): gst_qtdemux_loop ():
/GstBin:bin0/GstDecodeBin:decodebin0/GstQTDemux:qtdemux0:
streaming stopped, reason error (-5)
Debug logs with +mfplat,+gstreamer attached. I'm on Ubuntu 20.04. If I can
provide any other useful information please let me know.
--
Do not reply to this email, post in Bugzilla using the
above URL to reply.
You are receiving this mail because:
You are watching all bug changes.
https://bugs.winehq.org/show_bug.cgi?id=56377
Bug ID: 56377
Summary: Microsoft Edge freezes almost immediately after
launching
Product: Wine
Version: 9.3
Hardware: x86-64
OS: Linux
Status: UNCONFIRMED
Severity: normal
Priority: P2
Component: -unknown
Assignee: wine-bugs(a)winehq.org
Reporter: asdfghrbljzmkd(a)outlook.com
Distribution: ---
Microsoft Edge will freeze about 1-3 seconds after launching.
Steps to reproduce:
1. Download and install WebView2 (which includes Edge) from
https://developer.microsoft.com/en-us/microsoft-edge/webview2/
2. Run:
wine "/PATH/TO/PREFIX/drive_c/Program Files
(x86)/Microsoft/EdgeCore/VERSIONNUMBER/msedge.exe" --no-sandbox --disable-gpu
--no-first-run
Edge will launch, it will respond to inputs for a very short time, then freeze
completely.
--no-sandbox is required for it to launch at all, I will also file a bug for
this issue.
--disable-gpu is required wine wined3d, it can be dropped if using DXVK.
--no-first-run disables the first run prompting you to sign in and such, it has
no bearing on the bug itself. (If omitted, Edge still freezes, including the
dialog.)
--
Do not reply to this email, post in Bugzilla using the
above URL to reply.
You are receiving this mail because:
You are watching all bug changes.
https://bugs.winehq.org/show_bug.cgi?id=57851
Bug ID: 57851
Summary: Program Error Details
Product: Wine
Version: 9.0
Hardware: x86-64
OS: Linux
Status: UNCONFIRMED
Severity: normal
Priority: P2
Component: -unknown
Assignee: wine-bugs(a)winehq.org
Reporter: bwa7v393t(a)penicuick.mozmail.com
Distribution: ---
Created attachment 78072
--> https://bugs.winehq.org/attachment.cgi?id=78072
Back Trace File
See back trace.
--
Do not reply to this email, post in Bugzilla using the
above URL to reply.
You are receiving this mail because:
You are watching all bug changes.
https://bugs.winehq.org/show_bug.cgi?id=54964
Bug ID: 54964
Summary: i facing this bug
Product: Wine
Version: unspecified
Hardware: x86-64
OS: Linux
Status: UNCONFIRMED
Severity: normal
Priority: P2
Component: build-env
Assignee: wine-bugs(a)winehq.org
Reporter: hoichan62(a)gmail.com
Distribution: ---
Created attachment 74492
--> https://bugs.winehq.org/attachment.cgi?id=74492
microsoft program
when install microsoft edge it shows this look this issue.
--
Do not reply to this email, post in Bugzilla using the
above URL to reply.
You are receiving this mail because:
You are watching all bug changes.