Wine-Devel
By thread
wine-devel@list.winehq.org
By month
Messages by month
- ----- 2026 -----
- September
- August
- July
- June
- May
- April
- March
- February
- January
- ----- 2025 -----
- December
- November
- October
- September
- August
- July
- June
- May
- April
- March
- February
- January
- ----- 2024 -----
- December
- November
- October
- September
- August
- July
- June
- May
- April
- March
- February
- January
- ----- 2023 -----
- December
- November
- October
- September
- August
- July
- June
- May
- April
- March
- February
- January
- ----- 2022 -----
- December
- November
- October
- September
- August
- July
- June
- May
- April
- March
- February
- January
- ----- 2021 -----
- December
- November
- October
- September
- August
- July
- June
- May
- April
- March
- February
- January
- ----- 2020 -----
- December
- November
- October
- September
- August
- July
- June
- May
- April
- March
- February
- January
- ----- 2019 -----
- December
- November
- October
- September
- August
- July
- June
- May
- April
- March
- February
- January
- ----- 2018 -----
- December
- November
- October
- September
- August
- July
- June
- May
- April
- March
- February
- January
- ----- 2017 -----
- December
- November
- October
- September
- August
- July
- June
- May
- April
- March
- February
- January
- ----- 2016 -----
- December
- November
- October
- September
- August
- July
- June
- May
- April
- March
- February
- January
- ----- 2015 -----
- December
- November
- October
- September
- August
- July
- June
- May
- April
- March
- February
- January
- ----- 2014 -----
- December
- November
- October
- September
- August
- July
- June
- May
- April
- March
- February
- January
- ----- 2013 -----
- December
- November
- October
- September
- August
- July
- June
- May
- April
- March
- February
- January
- ----- 2012 -----
- December
- November
- October
- September
- August
- July
- June
- May
- April
- March
- February
- January
- ----- 2011 -----
- December
- November
- October
- September
- August
- July
- June
- May
- April
- March
- February
- January
- ----- 2010 -----
- December
- November
- October
- September
- August
- July
- June
- May
- April
- March
- February
- January
- ----- 2009 -----
- December
- November
- October
- September
- August
- July
- June
- May
- April
- March
- February
- January
- ----- 2008 -----
- December
- November
- October
- September
- August
- July
- June
- May
- April
- March
- February
- January
- ----- 2007 -----
- December
- November
- October
- September
- August
- July
- June
- May
- April
- March
- February
- January
- ----- 2006 -----
- December
- November
- October
- September
- August
- July
- June
- May
- April
- March
- February
- January
- ----- 2005 -----
- December
- November
- October
- September
- August
- July
- June
- May
- April
- March
- February
- January
- ----- 2004 -----
- December
- November
- October
- September
- August
- July
- June
- May
- April
- March
- February
- January
- ----- 2003 -----
- December
- November
- October
- September
- August
- July
- June
- May
- April
- March
- February
- January
- ----- 2002 -----
- December
- November
- October
- September
- August
- July
- June
- May
- April
- March
- February
- January
- ----- 2001 -----
- December
- November
- October
- September
- August
- July
- June
- May
- April
- March
- February
November 2021
- 83 participants
- 2620 messages
[PATCH] xml2: Use MSVC constants for NaN and infinity.
by Bernhard Kölbl
Prevent division by zero exceptions from being thrown,
if they are enabled and calls to xmlXPathInit() are being made.
Wine-Bug: https://bugs.winehq.org/show_bug.cgi?id=52003
Signed-off-by: Bernhard Kölbl <besentv(a)gmail.com>
---
I'm not really sure, if this change is really the correct solution to
the attached bug. Something that's still really odd to me, is the huge
amount of thrown exceptions. Also I wasn't able to create any test
code to reproduce this properly. I only had the reported program to
do testing and this change fixed the issue.
---
libs/xml2/xpath.c | 10 ++++------
1 file changed, 4 insertions(+), 6 deletions(-)
diff --git a/libs/xml2/xpath.c b/libs/xml2/xpath.c
index 7497ba07d6f..5fa3c72eb6c 100644
--- a/libs/xml2/xpath.c
+++ b/libs/xml2/xpath.c
@@ -497,14 +497,12 @@ double xmlXPathNINF;
*
* Initialize the XPath environment
*/
-ATTRIBUTE_NO_SANITIZE("float-divide-by-zero")
void
xmlXPathInit(void) {
- /* MSVC doesn't allow division by zero in constant expressions. */
- double zero = 0.0;
- xmlXPathNAN = 0.0 / zero;
- xmlXPathPINF = 1.0 / zero;
- xmlXPathNINF = -xmlXPathPINF;
+ /* Use MSVC definitions */
+ xmlXPathNAN = NAN;
+ xmlXPathPINF = INFINITY;
+ xmlXPathNINF = -INFINITY;
}
/**
--
2.33.0
Nov. 9, 2021
[PATCH v5 2/2] mshtml: Populate the element props properly.
by Gabriel Ivăncescu
For IE modes 8 and above, IHTMLElement::setAttribute uses the underlying
nsIDOMElement::SetAttribute, which does nothing since we're already
enumerating the ns attributes, and we're supposed to create the DISPIDs
for them.
Signed-off-by: Gabriel Ivăncescu <gabrielopcode(a)gmail.com>
---
dlls/mshtml/htmlelem.c | 5 ++++-
dlls/mshtml/tests/documentmode.js | 2 --
2 files changed, 4 insertions(+), 3 deletions(-)
diff --git a/dlls/mshtml/htmlelem.c b/dlls/mshtml/htmlelem.c
index 91ccfb9..9133a46 100644
--- a/dlls/mshtml/htmlelem.c
+++ b/dlls/mshtml/htmlelem.c
@@ -6516,7 +6516,10 @@ static HRESULT HTMLElement_populate_props(DispatchEx *dispex)
} else
V_BSTR(&value) = NULL;
- IHTMLElement_setAttribute(&This->IHTMLElement_iface, name, value, 0);
+ hres = IDispatchEx_GetDispID(&dispex->IDispatchEx_iface, name, fdexNameEnsure | fdexNameCaseInsensitive, &id);
+ if(SUCCEEDED(hres))
+ set_elem_attr_value_by_dispid(This, id, &value);
+
SysFreeString(name);
VariantClear(&value);
}
diff --git a/dlls/mshtml/tests/documentmode.js b/dlls/mshtml/tests/documentmode.js
index d566223..e7a3829 100644
--- a/dlls/mshtml/tests/documentmode.js
+++ b/dlls/mshtml/tests/documentmode.js
@@ -518,9 +518,7 @@ sync_test("createElement_inline_attr", function() {
for(var i = 0; i < tags.length; i++) {
e = document.createElement("<" + tags[i] + " test='a\"' abcd=\""b"\">");
ok(e.tagName === tags[i].toUpperCase(), "<" + tags[i] + " test=\"a\" abcd=\"b\">.tagName returned " + e.tagName);
- todo_wine_if(v == 8).
ok(e.test === "a\"", "<" + tags[i] + " test='a\"' abcd=\""b"\">.test returned " + e.test);
- todo_wine_if(v == 8).
ok(e.abcd === "\"b\"", "<" + tags[i] + " test='a\"' abcd=\""b"\">.abcd returned " + e.abcd);
}
}else {
--
2.31.1
Nov. 9, 2021
[PATCH v5 1/2] mshtml: Implement inline attributes parsing for createElement.
by Gabriel Ivăncescu
We let gecko parse a dummy unknown tag (after validation) using a contextual
fragment, and then copy its attributes to the proper element with correct tag.
Signed-off-by: Gabriel Ivăncescu <gabrielopcode(a)gmail.com>
---
dlls/mshtml/htmlelem.c | 134 +++++++++++++++++++++++++++++-
dlls/mshtml/tests/documentmode.js | 63 ++++++++++++++
2 files changed, 196 insertions(+), 1 deletion(-)
diff --git a/dlls/mshtml/htmlelem.c b/dlls/mshtml/htmlelem.c
index de69e2f..91ccfb9 100644
--- a/dlls/mshtml/htmlelem.c
+++ b/dlls/mshtml/htmlelem.c
@@ -355,6 +355,134 @@ static inline HTMLElement *impl_from_IHTMLElement(IHTMLElement *iface)
return CONTAINING_RECORD(iface, HTMLElement, IHTMLElement_iface);
}
+static HRESULT copy_nselem_attrs(nsIDOMElement *nselem_with_attrs, nsIDOMElement *nselem)
+{
+ nsIDOMMozNamedAttrMap *attrs;
+ nsAString name_str, val_str;
+ nsresult nsres, nsres2;
+ nsIDOMAttr *attr;
+ UINT32 i, length;
+
+ nsres = nsIDOMElement_GetAttributes(nselem_with_attrs, &attrs);
+ if(NS_FAILED(nsres))
+ return E_FAIL;
+
+ nsres = nsIDOMMozNamedAttrMap_GetLength(attrs, &length);
+ if(NS_FAILED(nsres)) {
+ nsIDOMMozNamedAttrMap_Release(attrs);
+ return E_FAIL;
+ }
+
+ nsAString_Init(&name_str, NULL);
+ nsAString_Init(&val_str, NULL);
+ for(i = 0; i < length; i++) {
+ nsres = nsIDOMMozNamedAttrMap_Item(attrs, i, &attr);
+ if(NS_FAILED(nsres))
+ continue;
+
+ nsres = nsIDOMAttr_GetNodeName(attr, &name_str);
+ nsres2 = nsIDOMAttr_GetNodeValue(attr, &val_str);
+ nsIDOMAttr_Release(attr);
+ if(NS_FAILED(nsres) || NS_FAILED(nsres2))
+ continue;
+
+ nsIDOMElement_SetAttribute(nselem, &name_str, &val_str);
+ }
+ nsAString_Finish(&name_str);
+ nsAString_Finish(&val_str);
+
+ nsIDOMMozNamedAttrMap_Release(attrs);
+ return S_OK;
+}
+
+static HRESULT create_nselem_parse(HTMLDocumentNode *doc, const WCHAR *tag, nsIDOMElement **ret)
+{
+ static const WCHAR prefix[4] = L"<FOO";
+ nsIDOMDocumentFragment *nsfragment;
+ WCHAR *p = wcschr(tag + 1, '>');
+ UINT32 i, name_len, size;
+ nsIDOMElement *nselem;
+ nsIDOMRange *nsrange;
+ nsIDOMNode *nsnode;
+ nsresult nsres;
+ nsAString str;
+ HRESULT hres;
+
+ if(!p || p[1] || wcschr(tag + 1, '<'))
+ return E_FAIL;
+ if(!doc->nsdoc) {
+ WARN("NULL nsdoc\n");
+ return E_UNEXPECTED;
+ }
+
+ /* Ignore the starting token and > or /> end token */
+ name_len = p - tag - 1 - (p[-1] == '/');
+
+ /* Get the tag name using HTML whitespace rules */
+ for(i = 1; i <= name_len; i++) {
+ if((tag[i] >= 0x09 && tag[i] <= 0x0d) || tag[i] == ' ') {
+ name_len = i - 1;
+ break;
+ }
+ }
+ if(!name_len)
+ return E_FAIL;
+ size = (p + 2 - (tag + 1 + name_len)) * sizeof(WCHAR);
+
+ /* Parse the input via a contextual fragment, using a dummy unknown tag */
+ nsres = nsIDOMHTMLDocument_CreateRange(doc->nsdoc, &nsrange);
+ if(NS_FAILED(nsres))
+ return map_nsresult(nsres);
+
+ if(!(p = heap_alloc(sizeof(prefix) + size))) {
+ nsIDOMRange_Release(nsrange);
+ return E_OUTOFMEMORY;
+ }
+ memcpy(p, prefix, sizeof(prefix));
+ memcpy(p + ARRAY_SIZE(prefix), tag + 1 + name_len, size);
+
+ nsAString_InitDepend(&str, p);
+ nsIDOMRange_CreateContextualFragment(nsrange, &str, &nsfragment);
+ nsIDOMRange_Release(nsrange);
+ nsAString_Finish(&str);
+ heap_free(p);
+ if(NS_FAILED(nsres))
+ return map_nsresult(nsres);
+
+ /* Grab the parsed element and copy its attributes into the proper element */
+ nsres = nsIDOMDocumentFragment_GetFirstChild(nsfragment, &nsnode);
+ nsIDOMDocumentFragment_Release(nsfragment);
+ if(NS_FAILED(nsres) || !nsnode)
+ return E_FAIL;
+
+ nsres = nsIDOMNode_QueryInterface(nsnode, &IID_nsIDOMElement, (void**)&nselem);
+ nsIDOMNode_Release(nsnode);
+ if(NS_FAILED(nsres))
+ return E_FAIL;
+
+ if(!(p = heap_alloc((name_len + 1) * sizeof(WCHAR))))
+ hres = E_OUTOFMEMORY;
+ else {
+ memcpy(p, tag + 1, name_len * sizeof(WCHAR));
+ p[name_len] = '\0';
+
+ nsAString_InitDepend(&str, p);
+ nsres = nsIDOMHTMLDocument_CreateElement(doc->nsdoc, &str, ret);
+ nsAString_Finish(&str);
+ heap_free(p);
+
+ if(NS_FAILED(nsres))
+ hres = map_nsresult(nsres);
+ else {
+ hres = copy_nselem_attrs(nselem, *ret);
+ if(FAILED(hres))
+ nsIDOMElement_Release(*ret);
+ }
+ }
+ nsIDOMElement_Release(nselem);
+ return hres;
+}
+
HRESULT create_nselem(HTMLDocumentNode *doc, const WCHAR *tag, nsIDOMElement **ret)
{
nsAString tag_str;
@@ -385,7 +513,11 @@ HRESULT create_element(HTMLDocumentNode *doc, const WCHAR *tag, HTMLElement **re
if(!doc->nsdoc)
doc = doc->node.doc;
- hres = create_nselem(doc, tag, &nselem);
+ /* IE8 and below allow creating elements with attributes, such as <div class="a"> */
+ if(tag[0] == '<' && dispex_compat_mode(&doc->node.event_target.dispex) <= COMPAT_MODE_IE8)
+ hres = create_nselem_parse(doc, tag, &nselem);
+ else
+ hres = create_nselem(doc, tag, &nselem);
if(FAILED(hres))
return hres;
diff --git a/dlls/mshtml/tests/documentmode.js b/dlls/mshtml/tests/documentmode.js
index 02a5f5f..d566223 100644
--- a/dlls/mshtml/tests/documentmode.js
+++ b/dlls/mshtml/tests/documentmode.js
@@ -488,6 +488,69 @@ sync_test("style_props", function() {
}
});
+sync_test("createElement_inline_attr", function() {
+ var v = document.documentMode, e, s;
+
+ if(v < 9) {
+ s = document.createElement("<div>").tagName;
+ ok(s === "DIV", "<div>.tagName returned " + s);
+ s = document.createElement("<div >").tagName;
+ ok(s === "DIV", "<div >.tagName returned " + s);
+ s = document.createElement("<div/>").tagName;
+ ok(s === "DIV", "<div/>.tagName returned " + s);
+ e = 0;
+ try {
+ document.createElement("<div");
+ }catch(ex) {
+ e = ex.number;
+ }
+ ok(e === 0x4005 - 0x80000000, "<div e = " + e);
+ e = 0;
+ try {
+ document.createElement("<div test=1");
+ }catch(ex) {
+ e = ex.number;
+ }
+ ok(e === 0x4005 - 0x80000000, "<div test=1 e = " + e);
+
+ var tags = [ "div", "head", "body", "title", "html" ];
+
+ for(var i = 0; i < tags.length; i++) {
+ e = document.createElement("<" + tags[i] + " test='a\"' abcd=\""b"\">");
+ ok(e.tagName === tags[i].toUpperCase(), "<" + tags[i] + " test=\"a\" abcd=\"b\">.tagName returned " + e.tagName);
+ todo_wine_if(v == 8).
+ ok(e.test === "a\"", "<" + tags[i] + " test='a\"' abcd=\""b"\">.test returned " + e.test);
+ todo_wine_if(v == 8).
+ ok(e.abcd === "\"b\"", "<" + tags[i] + " test='a\"' abcd=\""b"\">.abcd returned " + e.abcd);
+ }
+ }else {
+ s = "";
+ e = 0;
+ try {
+ document.createElement("<div>");
+ }catch(ex) {
+ s = ex.toString();
+ e = ex.number;
+ }
+ todo_wine.
+ ok(e === undefined, "<div> e = " + e);
+ todo_wine.
+ ok(s === "InvalidCharacterError", "<div> s = " + s);
+ s = "";
+ e = 0;
+ try {
+ document.createElement("<div test=\"a\">");
+ }catch(ex) {
+ s = ex.toString();
+ e = ex.number;
+ }
+ todo_wine.
+ ok(e === undefined, "<div test=\"a\"> e = " + e);
+ todo_wine.
+ ok(s === "InvalidCharacterError", "<div test=\"a\"> s = " + s);
+ }
+});
+
sync_test("JS objs", function() {
var g = window;
--
2.31.1
Nov. 9, 2021
Re: [PATCH v4 1/2] mshtml: Implement inline attributes parsing for createElement.
by Gabriel Ivăncescu
I'll take those tags out from the test, looks like Windows doesn't
capitalize unknown tags in old modes.
On 09/11/2021 19:54, Marvin wrote:
> Hi,
>
> While running your changed tests, I think I found new failures.
> Being a bot and all I'm not very good at pattern recognition, so I might be
> wrong, but could you please double-check?
>
> Full results can be found at:
> https://testbot.winehq.org/JobDetails.pl?Key=101571
>
> Your paranoid android.
>
>
> === w8adm (32 bit report) ===
>
> mshtml:
> events.c:1089: Test failed: unexpected call img_onerror
> events: Timeout
>
> === w8adm (32 bit report) ===
>
> mshtml:
> htmldoc.c:3084: Test failed: Incorrect error code: -2146697211
> htmldoc.c:3089: Test failed: Page address: L"http://test.winehq.org/tests/winehq_snapshot/"
> htmldoc.c:5861: Test failed: expected OnChanged_1012
> htmldoc.c:5862: Test failed: expected Exec_HTTPEQUIV
> htmldoc.c:5864: Test failed: expected Exec_SETTITLE
> htmldoc.c:5905: Test failed: expected FireNavigateComplete2
>
> === w10pro64_zh_CN (64 bit report) ===
>
> mshtml:
> htmldoc.c:2541: Test failed: unexpected call UpdateUI
> htmldoc.c:2853: Test failed: unexpected call Exec_UPDATECOMMANDS
>
> === w7u_2qxl (32 bit report) ===
>
> mshtml:
> script.c:624: Test failed: L"index.html?0:createElement_inline_attr: <template test=\"a\" abcd=\"b\">.tagName returned template"
> script.c:624: Test failed: L"index.html?0:createElement_inline_attr: <foo test=\"a\" abcd=\"b\">.tagName returned foo"
> script.c:624: Test failed: L"index.html?5:createElement_inline_attr: <template test=\"a\" abcd=\"b\">.tagName returned template"
> script.c:624: Test failed: L"index.html?5:createElement_inline_attr: <foo test=\"a\" abcd=\"b\">.tagName returned foo"
> script.c:624: Test failed: L"index.html?5:createElement_inline_attr: <template test=\"a\" abcd=\"b\">.tagName returned template"
> script.c:624: Test failed: L"index.html?5:createElement_inline_attr: <foo test=\"a\" abcd=\"b\">.tagName returned foo"
> script.c:624: Test failed: L"index.html?7:createElement_inline_attr: <template test=\"a\" abcd=\"b\">.tagName returned template"
> script.c:624: Test failed: L"index.html?7:createElement_inline_attr: <foo test=\"a\" abcd=\"b\">.tagName returned foo"
> script.c:624: Test failed: L"index.html?8:createElement_inline_attr: <template test=\"a\" abcd=\"b\">.tagName returned template"
> script.c:624: Test failed: L"index.html?8:createElement_inline_attr: <foo test=\"a\" abcd=\"b\">.tagName returned foo"
>
> === w7u_adm (32 bit report) ===
>
> mshtml:
> script.c:624: Test failed: L"index.html?0:createElement_inline_attr: <template test=\"a\" abcd=\"b\">.tagName returned template"
> script.c:624: Test failed: L"index.html?0:createElement_inline_attr: <foo test=\"a\" abcd=\"b\">.tagName returned foo"
> script.c:624: Test failed: L"index.html?5:createElement_inline_attr: <template test=\"a\" abcd=\"b\">.tagName returned template"
> script.c:624: Test failed: L"index.html?5:createElement_inline_attr: <foo test=\"a\" abcd=\"b\">.tagName returned foo"
> script.c:624: Test failed: L"index.html?5:createElement_inline_attr: <template test=\"a\" abcd=\"b\">.tagName returned template"
> script.c:624: Test failed: L"index.html?5:createElement_inline_attr: <foo test=\"a\" abcd=\"b\">.tagName returned foo"
> script.c:624: Test failed: L"index.html?7:createElement_inline_attr: <template test=\"a\" abcd=\"b\">.tagName returned template"
> script.c:624: Test failed: L"index.html?7:createElement_inline_attr: <foo test=\"a\" abcd=\"b\">.tagName returned foo"
> script.c:624: Test failed: L"index.html?8:createElement_inline_attr: <template test=\"a\" abcd=\"b\">.tagName returned template"
> script.c:624: Test failed: L"index.html?8:createElement_inline_attr: <foo test=\"a\" abcd=\"b\">.tagName returned foo"
>
> === w7u_el (32 bit report) ===
>
> mshtml:
> script.c:624: Test failed: L"index.html?0:createElement_inline_attr: <template test=\"a\" abcd=\"b\">.tagName returned template"
> script.c:624: Test failed: L"index.html?0:createElement_inline_attr: <foo test=\"a\" abcd=\"b\">.tagName returned foo"
> script.c:624: Test failed: L"index.html?5:createElement_inline_attr: <template test=\"a\" abcd=\"b\">.tagName returned template"
> script.c:624: Test failed: L"index.html?5:createElement_inline_attr: <foo test=\"a\" abcd=\"b\">.tagName returned foo"
> script.c:624: Test failed: L"index.html?5:createElement_inline_attr: <template test=\"a\" abcd=\"b\">.tagName returned template"
> script.c:624: Test failed: L"index.html?5:createElement_inline_attr: <foo test=\"a\" abcd=\"b\">.tagName returned foo"
> script.c:624: Test failed: L"index.html?7:createElement_inline_attr: <template test=\"a\" abcd=\"b\">.tagName returned template"
> script.c:624: Test failed: L"index.html?7:createElement_inline_attr: <foo test=\"a\" abcd=\"b\">.tagName returned foo"
> script.c:624: Test failed: L"index.html?8:createElement_inline_attr: <template test=\"a\" abcd=\"b\">.tagName returned template"
> script.c:624: Test failed: L"index.html?8:createElement_inline_attr: <foo test=\"a\" abcd=\"b\">.tagName returned foo"
>
> === w8 (32 bit report) ===
>
> mshtml:
> script.c:624: Test failed: L"index.html?0:createElement_inline_attr: <template test=\"a\" abcd=\"b\">.tagName returned template"
> script.c:624: Test failed: L"index.html?0:createElement_inline_attr: <foo test=\"a\" abcd=\"b\">.tagName returned foo"
> script.c:624: Test failed: L"index.html?5:createElement_inline_attr: <template test=\"a\" abcd=\"b\">.tagName returned template"
> script.c:624: Test failed: L"index.html?5:createElement_inline_attr: <foo test=\"a\" abcd=\"b\">.tagName returned foo"
> script.c:624: Test failed: L"index.html?5:createElement_inline_attr: <template test=\"a\" abcd=\"b\">.tagName returned template"
> script.c:624: Test failed: L"index.html?5:createElement_inline_attr: <foo test=\"a\" abcd=\"b\">.tagName returned foo"
> script.c:624: Test failed: L"index.html?7:createElement_inline_attr: <template test=\"a\" abcd=\"b\">.tagName returned template"
> script.c:624: Test failed: L"index.html?7:createElement_inline_attr: <foo test=\"a\" abcd=\"b\">.tagName returned foo"
> script.c:624: Test failed: L"index.html?8:createElement_inline_attr: <template test=\"a\" abcd=\"b\">.tagName returned template"
> script.c:624: Test failed: L"index.html?8:createElement_inline_attr: <foo test=\"a\" abcd=\"b\">.tagName returned foo"
>
> === w8adm (32 bit report) ===
>
> mshtml:
> script.c:624: Test failed: L"index.html?0:createElement_inline_attr: <template test=\"a\" abcd=\"b\">.tagName returned template"
> script.c:624: Test failed: L"index.html?0:createElement_inline_attr: <foo test=\"a\" abcd=\"b\">.tagName returned foo"
> script.c:624: Test failed: L"index.html?5:createElement_inline_attr: <template test=\"a\" abcd=\"b\">.tagName returned template"
> script.c:624: Test failed: L"index.html?5:createElement_inline_attr: <foo test=\"a\" abcd=\"b\">.tagName returned foo"
> script.c:624: Test failed: L"index.html?5:createElement_inline_attr: <template test=\"a\" abcd=\"b\">.tagName returned template"
> script.c:624: Test failed: L"index.html?5:createElement_inline_attr: <foo test=\"a\" abcd=\"b\">.tagName returned foo"
> script.c:624: Test failed: L"index.html?7:createElement_inline_attr: <template test=\"a\" abcd=\"b\">.tagName returned template"
> script.c:624: Test failed: L"index.html?7:createElement_inline_attr: <foo test=\"a\" abcd=\"b\">.tagName returned foo"
> script.c:624: Test failed: L"index.html?8:createElement_inline_attr: <template test=\"a\" abcd=\"b\">.tagName returned template"
> script.c:624: Test failed: L"index.html?8:createElement_inline_attr: <foo test=\"a\" abcd=\"b\">.tagName returned foo"
>
> === w864 (32 bit report) ===
>
> mshtml:
> script.c:624: Test failed: L"index.html?0:createElement_inline_attr: <template test=\"a\" abcd=\"b\">.tagName returned template"
> script.c:624: Test failed: L"index.html?0:createElement_inline_attr: <foo test=\"a\" abcd=\"b\">.tagName returned foo"
> script.c:624: Test failed: L"index.html?5:createElement_inline_attr: <template test=\"a\" abcd=\"b\">.tagName returned template"
> script.c:624: Test failed: L"index.html?5:createElement_inline_attr: <foo test=\"a\" abcd=\"b\">.tagName returned foo"
> script.c:624: Test failed: L"index.html?5:createElement_inline_attr: <template test=\"a\" abcd=\"b\">.tagName returned template"
> script.c:624: Test failed: L"index.html?5:createElement_inline_attr: <foo test=\"a\" abcd=\"b\">.tagName returned foo"
> script.c:624: Test failed: L"index.html?7:createElement_inline_attr: <template test=\"a\" abcd=\"b\">.tagName returned template"
> script.c:624: Test failed: L"index.html?7:createElement_inline_attr: <foo test=\"a\" abcd=\"b\">.tagName returned foo"
> script.c:624: Test failed: L"index.html?8:createElement_inline_attr: <template test=\"a\" abcd=\"b\">.tagName returned template"
> script.c:624: Test failed: L"index.html?8:createElement_inline_attr: <foo test=\"a\" abcd=\"b\">.tagName returned foo"
>
> === w1064v1507 (32 bit report) ===
>
> mshtml:
> script.c:624: Test failed: L"index.html?0:createElement_inline_attr: <template test=\"a\" abcd=\"b\">.tagName returned template"
> script.c:624: Test failed: L"index.html?0:createElement_inline_attr: <foo test=\"a\" abcd=\"b\">.tagName returned foo"
> script.c:624: Test failed: L"index.html?5:createElement_inline_attr: <template test=\"a\" abcd=\"b\">.tagName returned template"
> script.c:624: Test failed: L"index.html?5:createElement_inline_attr: <foo test=\"a\" abcd=\"b\">.tagName returned foo"
> script.c:624: Test failed: L"index.html?5:createElement_inline_attr: <template test=\"a\" abcd=\"b\">.tagName returned template"
> script.c:624: Test failed: L"index.html?5:createElement_inline_attr: <foo test=\"a\" abcd=\"b\">.tagName returned foo"
> script.c:624: Test failed: L"index.html?7:createElement_inline_attr: <template test=\"a\" abcd=\"b\">.tagName returned template"
> script.c:624: Test failed: L"index.html?7:createElement_inline_attr: <foo test=\"a\" abcd=\"b\">.tagName returned foo"
> script.c:624: Test failed: L"index.html?8:createElement_inline_attr: <template test=\"a\" abcd=\"b\">.tagName returned template"
> script.c:624: Test failed: L"index.html?8:createElement_inline_attr: <foo test=\"a\" abcd=\"b\">.tagName returned foo"
>
> === w1064v1809 (32 bit report) ===
>
> mshtml:
> script.c:624: Test failed: L"index.html?0:createElement_inline_attr: <template test=\"a\" abcd=\"b\">.tagName returned template"
> script.c:624: Test failed: L"index.html?0:createElement_inline_attr: <foo test=\"a\" abcd=\"b\">.tagName returned foo"
> script.c:624: Test failed: L"index.html?5:createElement_inline_attr: <template test=\"a\" abcd=\"b\">.tagName returned template"
> script.c:624: Test failed: L"index.html?5:createElement_inline_attr: <foo test=\"a\" abcd=\"b\">.tagName returned foo"
> script.c:624: Test failed: L"index.html?5:createElement_inline_attr: <template test=\"a\" abcd=\"b\">.tagName returned template"
> script.c:624: Test failed: L"index.html?5:createElement_inline_attr: <foo test=\"a\" abcd=\"b\">.tagName returned foo"
> script.c:624: Test failed: L"index.html?7:createElement_inline_attr: <template test=\"a\" abcd=\"b\">.tagName returned template"
> script.c:624: Test failed: L"index.html?7:createElement_inline_attr: <foo test=\"a\" abcd=\"b\">.tagName returned foo"
> script.c:624: Test failed: L"index.html?8:createElement_inline_attr: <template test=\"a\" abcd=\"b\">.tagName returned template"
> script.c:624: Test failed: L"index.html?8:createElement_inline_attr: <foo test=\"a\" abcd=\"b\">.tagName returned foo"
>
> === w1064 (32 bit report) ===
>
> mshtml:
> script.c:624: Test failed: L"index.html?0:createElement_inline_attr: <template test=\"a\" abcd=\"b\">.tagName returned template"
> script.c:624: Test failed: L"index.html?0:createElement_inline_attr: <foo test=\"a\" abcd=\"b\">.tagName returned foo"
> script.c:624: Test failed: L"index.html?5:createElement_inline_attr: <template test=\"a\" abcd=\"b\">.tagName returned template"
> script.c:624: Test failed: L"index.html?5:createElement_inline_attr: <foo test=\"a\" abcd=\"b\">.tagName returned foo"
> script.c:624: Test failed: L"index.html?5:createElement_inline_attr: <template test=\"a\" abcd=\"b\">.tagName returned template"
> script.c:624: Test failed: L"index.html?5:createElement_inline_attr: <foo test=\"a\" abcd=\"b\">.tagName returned foo"
> script.c:624: Test failed: L"index.html?7:createElement_inline_attr: <template test=\"a\" abcd=\"b\">.tagName returned template"
> script.c:624: Test failed: L"index.html?7:createElement_inline_attr: <foo test=\"a\" abcd=\"b\">.tagName returned foo"
> script.c:624: Test failed: L"index.html?8:createElement_inline_attr: <template test=\"a\" abcd=\"b\">.tagName returned template"
> script.c:624: Test failed: L"index.html?8:createElement_inline_attr: <foo test=\"a\" abcd=\"b\">.tagName returned foo"
>
> === w1064_tsign (32 bit report) ===
>
> mshtml:
> script.c:624: Test failed: L"index.html?0:createElement_inline_attr: <template test=\"a\" abcd=\"b\">.tagName returned template"
> script.c:624: Test failed: L"index.html?0:createElement_inline_attr: <foo test=\"a\" abcd=\"b\">.tagName returned foo"
> script.c:624: Test failed: L"index.html?5:createElement_inline_attr: <template test=\"a\" abcd=\"b\">.tagName returned template"
> script.c:624: Test failed: L"index.html?5:createElement_inline_attr: <foo test=\"a\" abcd=\"b\">.tagName returned foo"
> script.c:624: Test failed: L"index.html?5:createElement_inline_attr: <template test=\"a\" abcd=\"b\">.tagName returned template"
> script.c:624: Test failed: L"index.html?5:createElement_inline_attr: <foo test=\"a\" abcd=\"b\">.tagName returned foo"
> script.c:624: Test failed: L"index.html?7:createElement_inline_attr: <template test=\"a\" abcd=\"b\">.tagName returned template"
> script.c:624: Test failed: L"index.html?7:createElement_inline_attr: <foo test=\"a\" abcd=\"b\">.tagName returned foo"
> script.c:624: Test failed: L"index.html?8:createElement_inline_attr: <template test=\"a\" abcd=\"b\">.tagName returned template"
> script.c:624: Test failed: L"index.html?8:createElement_inline_attr: <foo test=\"a\" abcd=\"b\">.tagName returned foo"
>
> === w10pro64 (32 bit report) ===
>
> mshtml:
> script.c:624: Test failed: L"index.html?0:createElement_inline_attr: <template test=\"a\" abcd=\"b\">.tagName returned template"
> script.c:624: Test failed: L"index.html?0:createElement_inline_attr: <foo test=\"a\" abcd=\"b\">.tagName returned foo"
> script.c:624: Test failed: L"index.html?5:createElement_inline_attr: <template test=\"a\" abcd=\"b\">.tagName returned template"
> script.c:624: Test failed: L"index.html?5:createElement_inline_attr: <foo test=\"a\" abcd=\"b\">.tagName returned foo"
> script.c:624: Test failed: L"index.html?5:createElement_inline_attr: <template test=\"a\" abcd=\"b\">.tagName returned template"
> script.c:624: Test failed: L"index.html?5:createElement_inline_attr: <foo test=\"a\" abcd=\"b\">.tagName returned foo"
> script.c:624: Test failed: L"index.html?7:createElement_inline_attr: <template test=\"a\" abcd=\"b\">.tagName returned template"
> script.c:624: Test failed: L"index.html?7:createElement_inline_attr: <foo test=\"a\" abcd=\"b\">.tagName returned foo"
> script.c:624: Test failed: L"index.html?8:createElement_inline_attr: <template test=\"a\" abcd=\"b\">.tagName returned template"
> script.c:624: Test failed: L"index.html?8:createElement_inline_attr: <foo test=\"a\" abcd=\"b\">.tagName returned foo"
>
> === w864 (64 bit report) ===
>
> mshtml:
> script.c:624: Test failed: L"index.html?0:createElement_inline_attr: <template test=\"a\" abcd=\"b\">.tagName returned template"
> script.c:624: Test failed: L"index.html?0:createElement_inline_attr: <foo test=\"a\" abcd=\"b\">.tagName returned foo"
> script.c:624: Test failed: L"index.html?5:createElement_inline_attr: <template test=\"a\" abcd=\"b\">.tagName returned template"
> script.c:624: Test failed: L"index.html?5:createElement_inline_attr: <foo test=\"a\" abcd=\"b\">.tagName returned foo"
> script.c:624: Test failed: L"index.html?5:createElement_inline_attr: <template test=\"a\" abcd=\"b\">.tagName returned template"
> script.c:624: Test failed: L"index.html?5:createElement_inline_attr: <foo test=\"a\" abcd=\"b\">.tagName returned foo"
> script.c:624: Test failed: L"index.html?7:createElement_inline_attr: <template test=\"a\" abcd=\"b\">.tagName returned template"
> script.c:624: Test failed: L"index.html?7:createElement_inline_attr: <foo test=\"a\" abcd=\"b\">.tagName returned foo"
> script.c:624: Test failed: L"index.html?8:createElement_inline_attr: <template test=\"a\" abcd=\"b\">.tagName returned template"
> script.c:624: Test failed: L"index.html?8:createElement_inline_attr: <foo test=\"a\" abcd=\"b\">.tagName returned foo"
>
> === w1064v1507 (64 bit report) ===
>
> mshtml:
> script.c:624: Test failed: L"index.html?0:createElement_inline_attr: <template test=\"a\" abcd=\"b\">.tagName returned template"
> script.c:624: Test failed: L"index.html?0:createElement_inline_attr: <foo test=\"a\" abcd=\"b\">.tagName returned foo"
> script.c:624: Test failed: L"index.html?5:createElement_inline_attr: <template test=\"a\" abcd=\"b\">.tagName returned template"
> script.c:624: Test failed: L"index.html?5:createElement_inline_attr: <foo test=\"a\" abcd=\"b\">.tagName returned foo"
> script.c:624: Test failed: L"index.html?5:createElement_inline_attr: <template test=\"a\" abcd=\"b\">.tagName returned template"
> script.c:624: Test failed: L"index.html?5:createElement_inline_attr: <foo test=\"a\" abcd=\"b\">.tagName returned foo"
> script.c:624: Test failed: L"index.html?7:createElement_inline_attr: <template test=\"a\" abcd=\"b\">.tagName returned template"
> script.c:624: Test failed: L"index.html?7:createElement_inline_attr: <foo test=\"a\" abcd=\"b\">.tagName returned foo"
> script.c:624: Test failed: L"index.html?8:createElement_inline_attr: <template test=\"a\" abcd=\"b\">.tagName returned template"
> script.c:624: Test failed: L"index.html?8:createElement_inline_attr: <foo test=\"a\" abcd=\"b\">.tagName returned foo"
>
> === w1064v1809 (64 bit report) ===
>
> mshtml:
> script.c:624: Test failed: L"index.html?0:createElement_inline_attr: <template test=\"a\" abcd=\"b\">.tagName returned template"
> script.c:624: Test failed: L"index.html?0:createElement_inline_attr: <foo test=\"a\" abcd=\"b\">.tagName returned foo"
> script.c:624: Test failed: L"index.html?5:createElement_inline_attr: <template test=\"a\" abcd=\"b\">.tagName returned template"
> script.c:624: Test failed: L"index.html?5:createElement_inline_attr: <foo test=\"a\" abcd=\"b\">.tagName returned foo"
> script.c:624: Test failed: L"index.html?5:createElement_inline_attr: <template test=\"a\" abcd=\"b\">.tagName returned template"
> script.c:624: Test failed: L"index.html?5:createElement_inline_attr: <foo test=\"a\" abcd=\"b\">.tagName returned foo"
> script.c:624: Test failed: L"index.html?7:createElement_inline_attr: <template test=\"a\" abcd=\"b\">.tagName returned template"
> script.c:624: Test failed: L"index.html?7:createElement_inline_attr: <foo test=\"a\" abcd=\"b\">.tagName returned foo"
> script.c:624: Test failed: L"index.html?8:createElement_inline_attr: <template test=\"a\" abcd=\"b\">.tagName returned template"
> script.c:624: Test failed: L"index.html?8:createElement_inline_attr: <foo test=\"a\" abcd=\"b\">.tagName returned foo"
>
> === w1064 (64 bit report) ===
>
> mshtml:
> script.c:624: Test failed: L"index.html?0:createElement_inline_attr: <template test=\"a\" abcd=\"b\">.tagName returned template"
> script.c:624: Test failed: L"index.html?0:createElement_inline_attr: <foo test=\"a\" abcd=\"b\">.tagName returned foo"
> script.c:624: Test failed: L"index.html?5:createElement_inline_attr: <template test=\"a\" abcd=\"b\">.tagName returned template"
> script.c:624: Test failed: L"index.html?5:createElement_inline_attr: <foo test=\"a\" abcd=\"b\">.tagName returned foo"
> script.c:624: Test failed: L"index.html?5:createElement_inline_attr: <template test=\"a\" abcd=\"b\">.tagName returned template"
> script.c:624: Test failed: L"index.html?5:createElement_inline_attr: <foo test=\"a\" abcd=\"b\">.tagName returned foo"
> script.c:624: Test failed: L"index.html?7:createElement_inline_attr: <template test=\"a\" abcd=\"b\">.tagName returned template"
> script.c:624: Test failed: L"index.html?7:createElement_inline_attr: <foo test=\"a\" abcd=\"b\">.tagName returned foo"
> script.c:624: Test failed: L"index.html?8:createElement_inline_attr: <template test=\"a\" abcd=\"b\">.tagName returned template"
> script.c:624: Test failed: L"index.html?8:createElement_inline_attr: <foo test=\"a\" abcd=\"b\">.tagName returned foo"
>
> === w1064_2qxl (64 bit report) ===
>
> mshtml:
> script.c:624: Test failed: L"index.html?0:createElement_inline_attr: <template test=\"a\" abcd=\"b\">.tagName returned template"
> script.c:624: Test failed: L"index.html?0:createElement_inline_attr: <foo test=\"a\" abcd=\"b\">.tagName returned foo"
> script.c:624: Test failed: L"index.html?5:createElement_inline_attr: <template test=\"a\" abcd=\"b\">.tagName returned template"
> script.c:624: Test failed: L"index.html?5:createElement_inline_attr: <foo test=\"a\" abcd=\"b\">.tagName returned foo"
> script.c:624: Test failed: L"index.html?5:createElement_inline_attr: <template test=\"a\" abcd=\"b\">.tagName returned template"
> script.c:624: Test failed: L"index.html?5:createElement_inline_attr: <foo test=\"a\" abcd=\"b\">.tagName returned foo"
> script.c:624: Test failed: L"index.html?7:createElement_inline_attr: <template test=\"a\" abcd=\"b\">.tagName returned template"
> script.c:624: Test failed: L"index.html?7:createElement_inline_attr: <foo test=\"a\" abcd=\"b\">.tagName returned foo"
> script.c:624: Test failed: L"index.html?8:createElement_inline_attr: <template test=\"a\" abcd=\"b\">.tagName returned template"
> script.c:624: Test failed: L"index.html?8:createElement_inline_attr: <foo test=\"a\" abcd=\"b\">.tagName returned foo"
>
> === w1064_tsign (64 bit report) ===
>
> mshtml:
> script.c:624: Test failed: L"index.html?0:createElement_inline_attr: <template test=\"a\" abcd=\"b\">.tagName returned template"
> script.c:624: Test failed: L"index.html?0:createElement_inline_attr: <foo test=\"a\" abcd=\"b\">.tagName returned foo"
> script.c:624: Test failed: L"index.html?5:createElement_inline_attr: <template test=\"a\" abcd=\"b\">.tagName returned template"
> script.c:624: Test failed: L"index.html?5:createElement_inline_attr: <foo test=\"a\" abcd=\"b\">.tagName returned foo"
> script.c:624: Test failed: L"index.html?5:createElement_inline_attr: <template test=\"a\" abcd=\"b\">.tagName returned template"
> script.c:624: Test failed: L"index.html?5:createElement_inline_attr: <foo test=\"a\" abcd=\"b\">.tagName returned foo"
> script.c:624: Test failed: L"index.html?7:createElement_inline_attr: <template test=\"a\" abcd=\"b\">.tagName returned template"
> script.c:624: Test failed: L"index.html?7:createElement_inline_attr: <foo test=\"a\" abcd=\"b\">.tagName returned foo"
> script.c:624: Test failed: L"index.html?8:createElement_inline_attr: <template test=\"a\" abcd=\"b\">.tagName returned template"
> script.c:624: Test failed: L"index.html?8:createElement_inline_attr: <foo test=\"a\" abcd=\"b\">.tagName returned foo"
>
> === w10pro64 (64 bit report) ===
>
> mshtml:
> script.c:624: Test failed: L"index.html?0:createElement_inline_attr: <template test=\"a\" abcd=\"b\">.tagName returned template"
> script.c:624: Test failed: L"index.html?0:createElement_inline_attr: <foo test=\"a\" abcd=\"b\">.tagName returned foo"
> script.c:624: Test failed: L"index.html?5:createElement_inline_attr: <template test=\"a\" abcd=\"b\">.tagName returned template"
> script.c:624: Test failed: L"index.html?5:createElement_inline_attr: <foo test=\"a\" abcd=\"b\">.tagName returned foo"
> script.c:624: Test failed: L"index.html?5:createElement_inline_attr: <template test=\"a\" abcd=\"b\">.tagName returned template"
> script.c:624: Test failed: L"index.html?5:createElement_inline_attr: <foo test=\"a\" abcd=\"b\">.tagName returned foo"
> script.c:624: Test failed: L"index.html?7:createElement_inline_attr: <template test=\"a\" abcd=\"b\">.tagName returned template"
> script.c:624: Test failed: L"index.html?7:createElement_inline_attr: <foo test=\"a\" abcd=\"b\">.tagName returned foo"
> script.c:624: Test failed: L"index.html?8:createElement_inline_attr: <template test=\"a\" abcd=\"b\">.tagName returned template"
> script.c:624: Test failed: L"index.html?8:createElement_inline_attr: <foo test=\"a\" abcd=\"b\">.tagName returned foo"
>
> === w10pro64_ar (64 bit report) ===
>
> mshtml:
> script.c:624: Test failed: L"index.html?0:createElement_inline_attr: <template test=\"a\" abcd=\"b\">.tagName returned template"
> script.c:624: Test failed: L"index.html?0:createElement_inline_attr: <foo test=\"a\" abcd=\"b\">.tagName returned foo"
> script.c:624: Test failed: L"index.html?5:createElement_inline_attr: <template test=\"a\" abcd=\"b\">.tagName returned template"
> script.c:624: Test failed: L"index.html?5:createElement_inline_attr: <foo test=\"a\" abcd=\"b\">.tagName returned foo"
> script.c:624: Test failed: L"index.html?5:createElement_inline_attr: <template test=\"a\" abcd=\"b\">.tagName returned template"
> script.c:624: Test failed: L"index.html?5:createElement_inline_attr: <foo test=\"a\" abcd=\"b\">.tagName returned foo"
> script.c:624: Test failed: L"index.html?7:createElement_inline_attr: <template test=\"a\" abcd=\"b\">.tagName returned template"
> script.c:624: Test failed: L"index.html?7:createElement_inline_attr: <foo test=\"a\" abcd=\"b\">.tagName returned foo"
> script.c:624: Test failed: L"index.html?8:createElement_inline_attr: <template test=\"a\" abcd=\"b\">.tagName returned template"
> script.c:624: Test failed: L"index.html?8:createElement_inline_attr: <foo test=\"a\" abcd=\"b\">.tagName returned foo"
>
> === w10pro64_he (64 bit report) ===
>
> mshtml:
> script.c:624: Test failed: L"index.html?0:createElement_inline_attr: <template test=\"a\" abcd=\"b\">.tagName returned template"
> script.c:624: Test failed: L"index.html?0:createElement_inline_attr: <foo test=\"a\" abcd=\"b\">.tagName returned foo"
> script.c:624: Test failed: L"index.html?5:createElement_inline_attr: <template test=\"a\" abcd=\"b\">.tagName returned template"
> script.c:624: Test failed: L"index.html?5:createElement_inline_attr: <foo test=\"a\" abcd=\"b\">.tagName returned foo"
> script.c:624: Test failed: L"index.html?5:createElement_inline_attr: <template test=\"a\" abcd=\"b\">.tagName returned template"
> script.c:624: Test failed: L"index.html?5:createElement_inline_attr: <foo test=\"a\" abcd=\"b\">.tagName returned foo"
> script.c:624: Test failed: L"index.html?7:createElement_inline_attr: <template test=\"a\" abcd=\"b\">.tagName returned template"
> script.c:624: Test failed: L"index.html?7:createElement_inline_attr: <foo test=\"a\" abcd=\"b\">.tagName returned foo"
> script.c:624: Test failed: L"index.html?8:createElement_inline_attr: <template test=\"a\" abcd=\"b\">.tagName returned template"
> script.c:624: Test failed: L"index.html?8:createElement_inline_attr: <foo test=\"a\" abcd=\"b\">.tagName returned foo"
>
> === w10pro64_ja (64 bit report) ===
>
> mshtml:
> script.c:624: Test failed: L"index.html?0:createElement_inline_attr: <template test=\"a\" abcd=\"b\">.tagName returned template"
> script.c:624: Test failed: L"index.html?0:createElement_inline_attr: <foo test=\"a\" abcd=\"b\">.tagName returned foo"
> script.c:624: Test failed: L"index.html?5:createElement_inline_attr: <template test=\"a\" abcd=\"b\">.tagName returned template"
> script.c:624: Test failed: L"index.html?5:createElement_inline_attr: <foo test=\"a\" abcd=\"b\">.tagName returned foo"
> script.c:624: Test failed: L"index.html?5:createElement_inline_attr: <template test=\"a\" abcd=\"b\">.tagName returned template"
> script.c:624: Test failed: L"index.html?5:createElement_inline_attr: <foo test=\"a\" abcd=\"b\">.tagName returned foo"
> script.c:624: Test failed: L"index.html?7:createElement_inline_attr: <template test=\"a\" abcd=\"b\">.tagName returned template"
> script.c:624: Test failed: L"index.html?7:createElement_inline_attr: <foo test=\"a\" abcd=\"b\">.tagName returned foo"
> script.c:624: Test failed: L"index.html?8:createElement_inline_attr: <template test=\"a\" abcd=\"b\">.tagName returned template"
> script.c:624: Test failed: L"index.html?8:createElement_inline_attr: <foo test=\"a\" abcd=\"b\">.tagName returned foo"
>
> === w10pro64_zh_CN (64 bit report) ===
>
> mshtml:
> script.c:624: Test failed: L"index.html?0:createElement_inline_attr: <template test=\"a\" abcd=\"b\">.tagName returned template"
> script.c:624: Test failed: L"index.html?0:createElement_inline_attr: <foo test=\"a\" abcd=\"b\">.tagName returned foo"
> script.c:624: Test failed: L"index.html?5:createElement_inline_attr: <template test=\"a\" abcd=\"b\">.tagName returned template"
> script.c:624: Test failed: L"index.html?5:createElement_inline_attr: <foo test=\"a\" abcd=\"b\">.tagName returned foo"
> script.c:624: Test failed: L"index.html?5:createElement_inline_attr: <template test=\"a\" abcd=\"b\">.tagName returned template"
> script.c:624: Test failed: L"index.html?5:createElement_inline_attr: <foo test=\"a\" abcd=\"b\">.tagName returned foo"
> script.c:624: Test failed: L"index.html?7:createElement_inline_attr: <template test=\"a\" abcd=\"b\">.tagName returned template"
> script.c:624: Test failed: L"index.html?7:createElement_inline_attr: <foo test=\"a\" abcd=\"b\">.tagName returned foo"
> script.c:624: Test failed: L"index.html?8:createElement_inline_attr: <template test=\"a\" abcd=\"b\">.tagName returned template"
> script.c:624: Test failed: L"index.html?8:createElement_inline_attr: <foo test=\"a\" abcd=\"b\">.tagName returned foo"
>
Nov. 9, 2021
Re: [PATCH vkd3d 1/5] vkd3d-shader/hlsl: Use "false" instead of "0" as a bool immediate.
by Zebediah Figura (she/her)
Signed-off-by: Zebediah Figura <zfigura(a)codeweavers.com>
Nov. 9, 2021
Re: [PATCH 3/6] mfreadwrite/tests: Add some audio media type attributes tests.
by Nikolay Sivov
On 11/8/21 5:08 PM, Rémi Bernon wrote:
> + static const struct media_type_desc audio_44100_s8_desc =
> + {
> + .items =
> + {
> + {.key = &MF_MT_AUDIO_AVG_BYTES_PER_SECOND, .value = {.vt = VT_UI4, .ulVal = 44100}, .todo_missing = TRUE},
> + {.key = &MF_MT_AUDIO_BLOCK_ALIGNMENT, .value = {.vt = VT_UI4, .ulVal = 1}, .todo_missing = TRUE},
> + {.key = &MF_MT_AUDIO_NUM_CHANNELS, .value = {.vt = VT_UI4, .ulVal = 1}},
> + {.key = &MF_MT_MAJOR_TYPE, .value = {.vt = VT_CLSID, .puuid = (GUID *)&MFMediaType_Audio}},
> + {.key = &MF_MT_AUDIO_SAMPLES_PER_SECOND, .value = {.vt = VT_UI4, .ulVal = 44100}},
> + {.key = &MF_MT_AUDIO_PREFER_WAVEFORMATEX, .value = {.vt = VT_UI4, .ulVal = 1}, .todo_missing = TRUE},
> + {.key = &MF_MT_ALL_SAMPLES_INDEPENDENT, .value = {.vt = VT_UI4, .ulVal = 1}},
> + {.key = &MF_MT_AUDIO_BITS_PER_SAMPLE, .value = {.vt = VT_UI4, .ulVal = 8}},
> + {.key = &MF_MT_SUBTYPE, .value = {.vt = VT_CLSID, .puuid = (GUID *)&MFAudioFormat_PCM}},
> + },
> + .todo_spurious = 1,
> + };
When you explicitly checking audio types, you can drop MAJOR_TYPE,
PREFER_WAVEFORMATEX, ALL_SAMPLES_INDEPENDENT, or maybe even subtype from
static data, because it will always be the same. You can check for these
still right in the loop, for all data entries.
Nov. 9, 2021
Re: [PATCH 3/6] mfreadwrite/tests: Add some audio media type attributes tests.
by Nikolay Sivov
On 11/8/21 5:08 PM, Rémi Bernon wrote:
> + for (i = 0; i < count; i++)
> + {
> + PropVariantInit(&value);
> + hr = IMFMediaType_GetItemByIndex(media_type, i, &key, &value);
> + ok(hr == S_OK, "GetItemByIndex returned hr %#x\n", hr);
> +
> + for (j = 0; expect->items[j].key; j++) if (IsEqualGUID(expect->items[j].key, &key)) break;
> + if (!expect->items[j].key)
> + {
> + todo_wine_if(expect->todo_spurious > spurious_count)
> + ok(0, "spurious attribute %s\n", debugstr_guid(&key));
> + spurious_count++;
> + continue;
> + }
So this basically ignores "extra" attributes a type might have, that are
not accounted for in "expect"?
A rather arbitrary number of attributes we don't know about will be ignored.
Will it work if you checked for expected attributes only, doing a loop
over "expect" array,
and simply checking with CompareItem(expect.key, expect.value) ? This
way you don't know secondary search,
and we'll know that all of expected attributes matched.
> +
> + ok(!found[j], "duplicate attribute %s\n", debugstr_guid(&key));
> + found[j] = TRUE;
I don't understand this duplicate detection. If you're iterating once
through all attributes with zeroed "found[]",
how is it possible to get duplicated keys?
> +
> + if (!strcmp(winetest_platform, "wine"))
> + ok(!expect->items[j].todo_missing, "attribute not missing %s\n", debugstr_guid(&key));
> + ok(!PropVariantCompareEx(&value, &expect->items[j].value, 0, 0), "got %s, expected %s.\n",
> + debugstr_propvariant(&value), debugstr_propvariant(&expect->items[j].value));
> + PropVariantClear(&value);
> + }
Like I meantioned CompareItem() should probably work?
Nov. 9, 2021
Re: [PATCH v2 vkd3d] vkd3d-shader/hlsl: Allocate samplers.
by Zebediah Figura (she/her)
On 11/9/21 07:26, Matteo Bruni wrote:
> From: Zebediah Figura <zfigura(a)codeweavers.com>
>
> Signed-off-by: Matteo Bruni <mbruni(a)codeweavers.com>
> ---
> Now it should actually apply on top of 219117.
>
> libs/vkd3d-shader/hlsl_codegen.c | 59 ++++++++++++++++++++++++--------
> 1 file changed, 44 insertions(+), 15 deletions(-)
>
Yeah, this does look better; I guess I didn't try hard enough. Note
however there are a couple problems:
* this can't be used as-is for UAVs, because allocation doesn't start at
zero;
* this complicates tbuffers as well, for similar reasons. (Actually
things get worse with tbuffers, because now if you want to preserve that
"already bound" message you need a way of checking for *both* kinds of
objects.)
Neither one is particularly hard to solve, I guess, but I'm curious if
you have a plan for them.
> +static void allocate_objects(struct hlsl_ctx *ctx, enum hlsl_base_type type)
> +{
> + const struct object_type_info *type_info = get_object_type_info(type);
> struct hlsl_ir_var *var;
> uint32_t index = 0;
>
> LIST_FOR_EACH_ENTRY(var, &ctx->extern_vars, struct hlsl_ir_var, extern_entry)
> {
> if (!var->last_read || var->data_type->type != HLSL_CLASS_OBJECT
> - || var->data_type->base_type != HLSL_TYPE_TEXTURE)
> + || var->data_type->base_type != type)
> continue;
>
> - if (var->reg_reservation.type == 't')
> + if (var->reg_reservation.type == type_info->reg_name)
> {
> - const struct hlsl_ir_var *reserved_texture = get_reserved_texture(ctx, var->reg_reservation.index);
> + const struct hlsl_ir_var *reserved_object = get_reserved_object(ctx, type_info->reg_name,
> + var->reg_reservation.index);
>
> - if (reserved_texture && reserved_texture != var)
> + if (reserved_object && reserved_object != var)
> {
> hlsl_error(ctx, var->loc, VKD3D_SHADER_ERROR_HLSL_OVERLAPPING_RESERVATIONS,
> - "Multiple textures bound to t%u.", var->reg_reservation.index);
> - hlsl_note(ctx, reserved_texture->loc, VKD3D_SHADER_LOG_ERROR,
> - "Texture '%s' is already bound to t%u.", reserved_texture->name,
> + "Multiple %ss bound to %c%u.", type_info->name, type_info->reg_name,
> var->reg_reservation.index);
At this rate I would just say "multiple objects", since it's not like
there's extra semantic value in specifying the object type...
> + hlsl_note(ctx, reserved_object->loc, VKD3D_SHADER_LOG_ERROR,
> + "Object '%s' is already bound to %c%u.", reserved_object->name,
> + type_info->reg_name, var->reg_reservation.index);
> }
>
> var->reg.id = var->reg_reservation.index;
> var->reg.allocated = true;
> - TRACE("Allocated reserved %s to t%u.\n", var->name, var->reg_reservation.index);
> + TRACE("Allocated reserved %s to %c%u.\n", var->name, type_info->reg_name, var->reg_reservation.index);
> }
> else if (!var->reg_reservation.type)
> {
> - while (get_reserved_texture(ctx, index))
> + while (get_reserved_object(ctx, type_info->reg_name, index))
> ++index;
>
> var->reg.id = index;
> var->reg.allocated = true;
> - TRACE("Allocated %s to t%u.\n", var->name, index);
> + TRACE("Allocated %s to %c%u.\n", var->name, type_info->reg_name, index);
> ++index;
> }
> else
> {
> hlsl_error(ctx, var->loc, VKD3D_SHADER_ERROR_HLSL_INVALID_RESERVATION,
> - "Textures must be bound to register type 't'.");
> + "Object of type '%s' must be bound to register type '%c'.",
> + type_info->name, type_info->reg_name);
...and use hlsl_type_to_string() here, and then you don't need
type_info->name anymore.
Nov. 9, 2021
Re: [PATCH v4 2/2] mshtml: Populate the element props properly.
by Marvin
Hi,
While running your changed tests, I think I found new failures.
Being a bot and all I'm not very good at pattern recognition, so I might be
wrong, but could you please double-check?
Full results can be found at:
https://testbot.winehq.org/JobDetails.pl?Key=101572
Your paranoid android.
=== w8adm (32 bit report) ===
mshtml:
events.c:1089: Test failed: unexpected call img_onerror
events: Timeout
=== w8 (32 bit report) ===
mshtml:
htmldoc.c:2541: Test failed: unexpected call UpdateUI
htmldoc.c:2853: Test failed: unexpected call Exec_UPDATECOMMANDS
=== w10pro64 (32 bit report) ===
mshtml:
htmldoc.c:2541: Test failed: unexpected call UpdateUI
htmldoc.c:2853: Test failed: unexpected call Exec_UPDATECOMMANDS
htmldoc.c:350: Test failed: expected Exec_SETTITLE
htmldoc.c:2859: Test failed: unexpected call Exec_SETTITLE
=== w10pro64_ar (64 bit report) ===
mshtml:
htmldoc.c:2541: Test failed: unexpected call UpdateUI
htmldoc.c:2853: Test failed: unexpected call Exec_UPDATECOMMANDS
=== w7u_2qxl (32 bit report) ===
mshtml:
script.c:624: Test failed: L"index.html?0:createElement_inline_attr: <template test=\"a\" abcd=\"b\">.tagName returned template"
script.c:624: Test failed: L"index.html?0:createElement_inline_attr: <foo test=\"a\" abcd=\"b\">.tagName returned foo"
script.c:624: Test failed: L"index.html?5:createElement_inline_attr: <template test=\"a\" abcd=\"b\">.tagName returned template"
script.c:624: Test failed: L"index.html?5:createElement_inline_attr: <foo test=\"a\" abcd=\"b\">.tagName returned foo"
script.c:624: Test failed: L"index.html?5:createElement_inline_attr: <template test=\"a\" abcd=\"b\">.tagName returned template"
script.c:624: Test failed: L"index.html?5:createElement_inline_attr: <foo test=\"a\" abcd=\"b\">.tagName returned foo"
script.c:624: Test failed: L"index.html?7:createElement_inline_attr: <template test=\"a\" abcd=\"b\">.tagName returned template"
script.c:624: Test failed: L"index.html?7:createElement_inline_attr: <foo test=\"a\" abcd=\"b\">.tagName returned foo"
script.c:624: Test failed: L"index.html?8:createElement_inline_attr: <template test=\"a\" abcd=\"b\">.tagName returned template"
script.c:624: Test failed: L"index.html?8:createElement_inline_attr: <foo test=\"a\" abcd=\"b\">.tagName returned foo"
=== w7u_adm (32 bit report) ===
mshtml:
script.c:624: Test failed: L"/index.html?es5.js:date_now: unexpected Date.now() result 1636483754317 expected 1636483754372"
script.c:624: Test failed: L"index.html?0:createElement_inline_attr: <template test=\"a\" abcd=\"b\">.tagName returned template"
script.c:624: Test failed: L"index.html?0:createElement_inline_attr: <foo test=\"a\" abcd=\"b\">.tagName returned foo"
script.c:624: Test failed: L"index.html?5:createElement_inline_attr: <template test=\"a\" abcd=\"b\">.tagName returned template"
script.c:624: Test failed: L"index.html?5:createElement_inline_attr: <foo test=\"a\" abcd=\"b\">.tagName returned foo"
script.c:624: Test failed: L"index.html?5:createElement_inline_attr: <template test=\"a\" abcd=\"b\">.tagName returned template"
script.c:624: Test failed: L"index.html?5:createElement_inline_attr: <foo test=\"a\" abcd=\"b\">.tagName returned foo"
script.c:624: Test failed: L"index.html?7:createElement_inline_attr: <template test=\"a\" abcd=\"b\">.tagName returned template"
script.c:624: Test failed: L"index.html?7:createElement_inline_attr: <foo test=\"a\" abcd=\"b\">.tagName returned foo"
script.c:624: Test failed: L"index.html?8:createElement_inline_attr: <template test=\"a\" abcd=\"b\">.tagName returned template"
script.c:624: Test failed: L"index.html?8:createElement_inline_attr: <foo test=\"a\" abcd=\"b\">.tagName returned foo"
=== w7u_el (32 bit report) ===
mshtml:
script.c:624: Test failed: L"index.html?0:createElement_inline_attr: <template test=\"a\" abcd=\"b\">.tagName returned template"
script.c:624: Test failed: L"index.html?0:createElement_inline_attr: <foo test=\"a\" abcd=\"b\">.tagName returned foo"
script.c:624: Test failed: L"index.html?5:createElement_inline_attr: <template test=\"a\" abcd=\"b\">.tagName returned template"
script.c:624: Test failed: L"index.html?5:createElement_inline_attr: <foo test=\"a\" abcd=\"b\">.tagName returned foo"
script.c:624: Test failed: L"index.html?5:createElement_inline_attr: <template test=\"a\" abcd=\"b\">.tagName returned template"
script.c:624: Test failed: L"index.html?5:createElement_inline_attr: <foo test=\"a\" abcd=\"b\">.tagName returned foo"
script.c:624: Test failed: L"index.html?7:createElement_inline_attr: <template test=\"a\" abcd=\"b\">.tagName returned template"
script.c:624: Test failed: L"index.html?7:createElement_inline_attr: <foo test=\"a\" abcd=\"b\">.tagName returned foo"
script.c:624: Test failed: L"index.html?8:createElement_inline_attr: <template test=\"a\" abcd=\"b\">.tagName returned template"
script.c:624: Test failed: L"index.html?8:createElement_inline_attr: <foo test=\"a\" abcd=\"b\">.tagName returned foo"
=== w8 (32 bit report) ===
mshtml:
script.c:624: Test failed: L"index.html?0:createElement_inline_attr: <template test=\"a\" abcd=\"b\">.tagName returned template"
script.c:624: Test failed: L"index.html?0:createElement_inline_attr: <foo test=\"a\" abcd=\"b\">.tagName returned foo"
script.c:624: Test failed: L"index.html?5:createElement_inline_attr: <template test=\"a\" abcd=\"b\">.tagName returned template"
script.c:624: Test failed: L"index.html?5:createElement_inline_attr: <foo test=\"a\" abcd=\"b\">.tagName returned foo"
script.c:624: Test failed: L"index.html?5:createElement_inline_attr: <template test=\"a\" abcd=\"b\">.tagName returned template"
script.c:624: Test failed: L"index.html?5:createElement_inline_attr: <foo test=\"a\" abcd=\"b\">.tagName returned foo"
script.c:624: Test failed: L"index.html?7:createElement_inline_attr: <template test=\"a\" abcd=\"b\">.tagName returned template"
script.c:624: Test failed: L"index.html?7:createElement_inline_attr: <foo test=\"a\" abcd=\"b\">.tagName returned foo"
script.c:624: Test failed: L"index.html?8:createElement_inline_attr: <template test=\"a\" abcd=\"b\">.tagName returned template"
script.c:624: Test failed: L"index.html?8:createElement_inline_attr: <foo test=\"a\" abcd=\"b\">.tagName returned foo"
=== w8adm (32 bit report) ===
mshtml:
script.c:624: Test failed: L"index.html?0:createElement_inline_attr: <template test=\"a\" abcd=\"b\">.tagName returned template"
script.c:624: Test failed: L"index.html?0:createElement_inline_attr: <foo test=\"a\" abcd=\"b\">.tagName returned foo"
script.c:624: Test failed: L"index.html?5:createElement_inline_attr: <template test=\"a\" abcd=\"b\">.tagName returned template"
script.c:624: Test failed: L"index.html?5:createElement_inline_attr: <foo test=\"a\" abcd=\"b\">.tagName returned foo"
script.c:624: Test failed: L"index.html?5:createElement_inline_attr: <template test=\"a\" abcd=\"b\">.tagName returned template"
script.c:624: Test failed: L"index.html?5:createElement_inline_attr: <foo test=\"a\" abcd=\"b\">.tagName returned foo"
script.c:624: Test failed: L"index.html?7:createElement_inline_attr: <template test=\"a\" abcd=\"b\">.tagName returned template"
script.c:624: Test failed: L"index.html?7:createElement_inline_attr: <foo test=\"a\" abcd=\"b\">.tagName returned foo"
script.c:624: Test failed: L"index.html?8:createElement_inline_attr: <template test=\"a\" abcd=\"b\">.tagName returned template"
script.c:624: Test failed: L"index.html?8:createElement_inline_attr: <foo test=\"a\" abcd=\"b\">.tagName returned foo"
=== w864 (32 bit report) ===
mshtml:
script.c:624: Test failed: L"index.html?0:createElement_inline_attr: <template test=\"a\" abcd=\"b\">.tagName returned template"
script.c:624: Test failed: L"index.html?0:createElement_inline_attr: <foo test=\"a\" abcd=\"b\">.tagName returned foo"
script.c:624: Test failed: L"index.html?5:createElement_inline_attr: <template test=\"a\" abcd=\"b\">.tagName returned template"
script.c:624: Test failed: L"index.html?5:createElement_inline_attr: <foo test=\"a\" abcd=\"b\">.tagName returned foo"
script.c:624: Test failed: L"index.html?5:createElement_inline_attr: <template test=\"a\" abcd=\"b\">.tagName returned template"
script.c:624: Test failed: L"index.html?5:createElement_inline_attr: <foo test=\"a\" abcd=\"b\">.tagName returned foo"
script.c:624: Test failed: L"index.html?7:createElement_inline_attr: <template test=\"a\" abcd=\"b\">.tagName returned template"
script.c:624: Test failed: L"index.html?7:createElement_inline_attr: <foo test=\"a\" abcd=\"b\">.tagName returned foo"
script.c:624: Test failed: L"index.html?8:createElement_inline_attr: <template test=\"a\" abcd=\"b\">.tagName returned template"
script.c:624: Test failed: L"index.html?8:createElement_inline_attr: <foo test=\"a\" abcd=\"b\">.tagName returned foo"
=== w1064v1507 (32 bit report) ===
mshtml:
script.c:624: Test failed: L"index.html?0:createElement_inline_attr: <template test=\"a\" abcd=\"b\">.tagName returned template"
script.c:624: Test failed: L"index.html?0:createElement_inline_attr: <foo test=\"a\" abcd=\"b\">.tagName returned foo"
script.c:624: Test failed: L"index.html?5:createElement_inline_attr: <template test=\"a\" abcd=\"b\">.tagName returned template"
script.c:624: Test failed: L"index.html?5:createElement_inline_attr: <foo test=\"a\" abcd=\"b\">.tagName returned foo"
script.c:624: Test failed: L"index.html?5:createElement_inline_attr: <template test=\"a\" abcd=\"b\">.tagName returned template"
script.c:624: Test failed: L"index.html?5:createElement_inline_attr: <foo test=\"a\" abcd=\"b\">.tagName returned foo"
script.c:624: Test failed: L"index.html?7:createElement_inline_attr: <template test=\"a\" abcd=\"b\">.tagName returned template"
script.c:624: Test failed: L"index.html?7:createElement_inline_attr: <foo test=\"a\" abcd=\"b\">.tagName returned foo"
script.c:624: Test failed: L"index.html?8:createElement_inline_attr: <template test=\"a\" abcd=\"b\">.tagName returned template"
script.c:624: Test failed: L"index.html?8:createElement_inline_attr: <foo test=\"a\" abcd=\"b\">.tagName returned foo"
=== w1064v1809 (32 bit report) ===
mshtml:
script.c:624: Test failed: L"index.html?0:createElement_inline_attr: <template test=\"a\" abcd=\"b\">.tagName returned template"
script.c:624: Test failed: L"index.html?0:createElement_inline_attr: <foo test=\"a\" abcd=\"b\">.tagName returned foo"
script.c:624: Test failed: L"index.html?5:createElement_inline_attr: <template test=\"a\" abcd=\"b\">.tagName returned template"
script.c:624: Test failed: L"index.html?5:createElement_inline_attr: <foo test=\"a\" abcd=\"b\">.tagName returned foo"
script.c:624: Test failed: L"index.html?5:createElement_inline_attr: <template test=\"a\" abcd=\"b\">.tagName returned template"
script.c:624: Test failed: L"index.html?5:createElement_inline_attr: <foo test=\"a\" abcd=\"b\">.tagName returned foo"
script.c:624: Test failed: L"index.html?7:createElement_inline_attr: <template test=\"a\" abcd=\"b\">.tagName returned template"
script.c:624: Test failed: L"index.html?7:createElement_inline_attr: <foo test=\"a\" abcd=\"b\">.tagName returned foo"
script.c:624: Test failed: L"index.html?8:createElement_inline_attr: <template test=\"a\" abcd=\"b\">.tagName returned template"
script.c:624: Test failed: L"index.html?8:createElement_inline_attr: <foo test=\"a\" abcd=\"b\">.tagName returned foo"
=== w1064 (32 bit report) ===
mshtml:
script.c:624: Test failed: L"index.html?0:createElement_inline_attr: <template test=\"a\" abcd=\"b\">.tagName returned template"
script.c:624: Test failed: L"index.html?0:createElement_inline_attr: <foo test=\"a\" abcd=\"b\">.tagName returned foo"
script.c:624: Test failed: L"index.html?5:createElement_inline_attr: <template test=\"a\" abcd=\"b\">.tagName returned template"
script.c:624: Test failed: L"index.html?5:createElement_inline_attr: <foo test=\"a\" abcd=\"b\">.tagName returned foo"
script.c:624: Test failed: L"index.html?5:createElement_inline_attr: <template test=\"a\" abcd=\"b\">.tagName returned template"
script.c:624: Test failed: L"index.html?5:createElement_inline_attr: <foo test=\"a\" abcd=\"b\">.tagName returned foo"
script.c:624: Test failed: L"index.html?7:createElement_inline_attr: <template test=\"a\" abcd=\"b\">.tagName returned template"
script.c:624: Test failed: L"index.html?7:createElement_inline_attr: <foo test=\"a\" abcd=\"b\">.tagName returned foo"
script.c:624: Test failed: L"index.html?8:createElement_inline_attr: <template test=\"a\" abcd=\"b\">.tagName returned template"
script.c:624: Test failed: L"index.html?8:createElement_inline_attr: <foo test=\"a\" abcd=\"b\">.tagName returned foo"
=== w1064_tsign (32 bit report) ===
mshtml:
script.c:624: Test failed: L"index.html?0:createElement_inline_attr: <template test=\"a\" abcd=\"b\">.tagName returned template"
script.c:624: Test failed: L"index.html?0:createElement_inline_attr: <foo test=\"a\" abcd=\"b\">.tagName returned foo"
script.c:624: Test failed: L"index.html?5:createElement_inline_attr: <template test=\"a\" abcd=\"b\">.tagName returned template"
script.c:624: Test failed: L"index.html?5:createElement_inline_attr: <foo test=\"a\" abcd=\"b\">.tagName returned foo"
script.c:624: Test failed: L"index.html?5:createElement_inline_attr: <template test=\"a\" abcd=\"b\">.tagName returned template"
script.c:624: Test failed: L"index.html?5:createElement_inline_attr: <foo test=\"a\" abcd=\"b\">.tagName returned foo"
script.c:624: Test failed: L"index.html?7:createElement_inline_attr: <template test=\"a\" abcd=\"b\">.tagName returned template"
script.c:624: Test failed: L"index.html?7:createElement_inline_attr: <foo test=\"a\" abcd=\"b\">.tagName returned foo"
script.c:624: Test failed: L"index.html?8:createElement_inline_attr: <template test=\"a\" abcd=\"b\">.tagName returned template"
script.c:624: Test failed: L"index.html?8:createElement_inline_attr: <foo test=\"a\" abcd=\"b\">.tagName returned foo"
=== w10pro64 (32 bit report) ===
mshtml:
script.c:624: Test failed: L"index.html?0:createElement_inline_attr: <template test=\"a\" abcd=\"b\">.tagName returned template"
script.c:624: Test failed: L"index.html?0:createElement_inline_attr: <foo test=\"a\" abcd=\"b\">.tagName returned foo"
script.c:624: Test failed: L"index.html?5:createElement_inline_attr: <template test=\"a\" abcd=\"b\">.tagName returned template"
script.c:624: Test failed: L"index.html?5:createElement_inline_attr: <foo test=\"a\" abcd=\"b\">.tagName returned foo"
script.c:624: Test failed: L"index.html?5:createElement_inline_attr: <template test=\"a\" abcd=\"b\">.tagName returned template"
script.c:624: Test failed: L"index.html?5:createElement_inline_attr: <foo test=\"a\" abcd=\"b\">.tagName returned foo"
script.c:624: Test failed: L"index.html?7:createElement_inline_attr: <template test=\"a\" abcd=\"b\">.tagName returned template"
script.c:624: Test failed: L"index.html?7:createElement_inline_attr: <foo test=\"a\" abcd=\"b\">.tagName returned foo"
script.c:624: Test failed: L"index.html?8:createElement_inline_attr: <template test=\"a\" abcd=\"b\">.tagName returned template"
script.c:624: Test failed: L"index.html?8:createElement_inline_attr: <foo test=\"a\" abcd=\"b\">.tagName returned foo"
=== w864 (64 bit report) ===
mshtml:
script.c:624: Test failed: L"index.html?0:createElement_inline_attr: <template test=\"a\" abcd=\"b\">.tagName returned template"
script.c:624: Test failed: L"index.html?0:createElement_inline_attr: <foo test=\"a\" abcd=\"b\">.tagName returned foo"
script.c:624: Test failed: L"index.html?5:createElement_inline_attr: <template test=\"a\" abcd=\"b\">.tagName returned template"
script.c:624: Test failed: L"index.html?5:createElement_inline_attr: <foo test=\"a\" abcd=\"b\">.tagName returned foo"
script.c:624: Test failed: L"index.html?5:createElement_inline_attr: <template test=\"a\" abcd=\"b\">.tagName returned template"
script.c:624: Test failed: L"index.html?5:createElement_inline_attr: <foo test=\"a\" abcd=\"b\">.tagName returned foo"
script.c:624: Test failed: L"index.html?7:createElement_inline_attr: <template test=\"a\" abcd=\"b\">.tagName returned template"
script.c:624: Test failed: L"index.html?7:createElement_inline_attr: <foo test=\"a\" abcd=\"b\">.tagName returned foo"
script.c:624: Test failed: L"index.html?8:createElement_inline_attr: <template test=\"a\" abcd=\"b\">.tagName returned template"
script.c:624: Test failed: L"index.html?8:createElement_inline_attr: <foo test=\"a\" abcd=\"b\">.tagName returned foo"
=== w1064v1507 (64 bit report) ===
mshtml:
script.c:624: Test failed: L"index.html?0:createElement_inline_attr: <template test=\"a\" abcd=\"b\">.tagName returned template"
script.c:624: Test failed: L"index.html?0:createElement_inline_attr: <foo test=\"a\" abcd=\"b\">.tagName returned foo"
script.c:624: Test failed: L"index.html?5:createElement_inline_attr: <template test=\"a\" abcd=\"b\">.tagName returned template"
script.c:624: Test failed: L"index.html?5:createElement_inline_attr: <foo test=\"a\" abcd=\"b\">.tagName returned foo"
script.c:624: Test failed: L"index.html?5:createElement_inline_attr: <template test=\"a\" abcd=\"b\">.tagName returned template"
script.c:624: Test failed: L"index.html?5:createElement_inline_attr: <foo test=\"a\" abcd=\"b\">.tagName returned foo"
script.c:624: Test failed: L"index.html?7:createElement_inline_attr: <template test=\"a\" abcd=\"b\">.tagName returned template"
script.c:624: Test failed: L"index.html?7:createElement_inline_attr: <foo test=\"a\" abcd=\"b\">.tagName returned foo"
script.c:624: Test failed: L"index.html?8:createElement_inline_attr: <template test=\"a\" abcd=\"b\">.tagName returned template"
script.c:624: Test failed: L"index.html?8:createElement_inline_attr: <foo test=\"a\" abcd=\"b\">.tagName returned foo"
=== w1064v1809 (64 bit report) ===
mshtml:
script.c:624: Test failed: L"index.html?0:createElement_inline_attr: <template test=\"a\" abcd=\"b\">.tagName returned template"
script.c:624: Test failed: L"index.html?0:createElement_inline_attr: <foo test=\"a\" abcd=\"b\">.tagName returned foo"
script.c:624: Test failed: L"index.html?5:createElement_inline_attr: <template test=\"a\" abcd=\"b\">.tagName returned template"
script.c:624: Test failed: L"index.html?5:createElement_inline_attr: <foo test=\"a\" abcd=\"b\">.tagName returned foo"
script.c:624: Test failed: L"index.html?5:createElement_inline_attr: <template test=\"a\" abcd=\"b\">.tagName returned template"
script.c:624: Test failed: L"index.html?5:createElement_inline_attr: <foo test=\"a\" abcd=\"b\">.tagName returned foo"
script.c:624: Test failed: L"index.html?7:createElement_inline_attr: <template test=\"a\" abcd=\"b\">.tagName returned template"
script.c:624: Test failed: L"index.html?7:createElement_inline_attr: <foo test=\"a\" abcd=\"b\">.tagName returned foo"
script.c:624: Test failed: L"index.html?8:createElement_inline_attr: <template test=\"a\" abcd=\"b\">.tagName returned template"
script.c:624: Test failed: L"index.html?8:createElement_inline_attr: <foo test=\"a\" abcd=\"b\">.tagName returned foo"
=== w1064 (64 bit report) ===
mshtml:
script.c:624: Test failed: L"index.html?0:createElement_inline_attr: <template test=\"a\" abcd=\"b\">.tagName returned template"
script.c:624: Test failed: L"index.html?0:createElement_inline_attr: <foo test=\"a\" abcd=\"b\">.tagName returned foo"
script.c:624: Test failed: L"index.html?5:createElement_inline_attr: <template test=\"a\" abcd=\"b\">.tagName returned template"
script.c:624: Test failed: L"index.html?5:createElement_inline_attr: <foo test=\"a\" abcd=\"b\">.tagName returned foo"
script.c:624: Test failed: L"index.html?5:createElement_inline_attr: <template test=\"a\" abcd=\"b\">.tagName returned template"
script.c:624: Test failed: L"index.html?5:createElement_inline_attr: <foo test=\"a\" abcd=\"b\">.tagName returned foo"
script.c:624: Test failed: L"index.html?7:createElement_inline_attr: <template test=\"a\" abcd=\"b\">.tagName returned template"
script.c:624: Test failed: L"index.html?7:createElement_inline_attr: <foo test=\"a\" abcd=\"b\">.tagName returned foo"
script.c:624: Test failed: L"index.html?8:createElement_inline_attr: <template test=\"a\" abcd=\"b\">.tagName returned template"
script.c:624: Test failed: L"index.html?8:createElement_inline_attr: <foo test=\"a\" abcd=\"b\">.tagName returned foo"
=== w1064_2qxl (64 bit report) ===
mshtml:
script.c:624: Test failed: L"index.html?0:createElement_inline_attr: <template test=\"a\" abcd=\"b\">.tagName returned template"
script.c:624: Test failed: L"index.html?0:createElement_inline_attr: <foo test=\"a\" abcd=\"b\">.tagName returned foo"
script.c:624: Test failed: L"index.html?5:createElement_inline_attr: <template test=\"a\" abcd=\"b\">.tagName returned template"
script.c:624: Test failed: L"index.html?5:createElement_inline_attr: <foo test=\"a\" abcd=\"b\">.tagName returned foo"
script.c:624: Test failed: L"index.html?5:createElement_inline_attr: <template test=\"a\" abcd=\"b\">.tagName returned template"
script.c:624: Test failed: L"index.html?5:createElement_inline_attr: <foo test=\"a\" abcd=\"b\">.tagName returned foo"
script.c:624: Test failed: L"index.html?7:createElement_inline_attr: <template test=\"a\" abcd=\"b\">.tagName returned template"
script.c:624: Test failed: L"index.html?7:createElement_inline_attr: <foo test=\"a\" abcd=\"b\">.tagName returned foo"
script.c:624: Test failed: L"index.html?8:createElement_inline_attr: <template test=\"a\" abcd=\"b\">.tagName returned template"
script.c:624: Test failed: L"index.html?8:createElement_inline_attr: <foo test=\"a\" abcd=\"b\">.tagName returned foo"
=== w1064_tsign (64 bit report) ===
mshtml:
script.c:624: Test failed: L"index.html?0:createElement_inline_attr: <template test=\"a\" abcd=\"b\">.tagName returned template"
script.c:624: Test failed: L"index.html?0:createElement_inline_attr: <foo test=\"a\" abcd=\"b\">.tagName returned foo"
script.c:624: Test failed: L"index.html?5:createElement_inline_attr: <template test=\"a\" abcd=\"b\">.tagName returned template"
script.c:624: Test failed: L"index.html?5:createElement_inline_attr: <foo test=\"a\" abcd=\"b\">.tagName returned foo"
script.c:624: Test failed: L"index.html?5:createElement_inline_attr: <template test=\"a\" abcd=\"b\">.tagName returned template"
script.c:624: Test failed: L"index.html?5:createElement_inline_attr: <foo test=\"a\" abcd=\"b\">.tagName returned foo"
script.c:624: Test failed: L"index.html?7:createElement_inline_attr: <template test=\"a\" abcd=\"b\">.tagName returned template"
script.c:624: Test failed: L"index.html?7:createElement_inline_attr: <foo test=\"a\" abcd=\"b\">.tagName returned foo"
script.c:624: Test failed: L"index.html?8:createElement_inline_attr: <template test=\"a\" abcd=\"b\">.tagName returned template"
script.c:624: Test failed: L"index.html?8:createElement_inline_attr: <foo test=\"a\" abcd=\"b\">.tagName returned foo"
=== w10pro64 (64 bit report) ===
mshtml:
script.c:624: Test failed: L"index.html?0:createElement_inline_attr: <template test=\"a\" abcd=\"b\">.tagName returned template"
script.c:624: Test failed: L"index.html?0:createElement_inline_attr: <foo test=\"a\" abcd=\"b\">.tagName returned foo"
script.c:624: Test failed: L"index.html?5:createElement_inline_attr: <template test=\"a\" abcd=\"b\">.tagName returned template"
script.c:624: Test failed: L"index.html?5:createElement_inline_attr: <foo test=\"a\" abcd=\"b\">.tagName returned foo"
script.c:624: Test failed: L"index.html?5:createElement_inline_attr: <template test=\"a\" abcd=\"b\">.tagName returned template"
script.c:624: Test failed: L"index.html?5:createElement_inline_attr: <foo test=\"a\" abcd=\"b\">.tagName returned foo"
script.c:624: Test failed: L"index.html?7:createElement_inline_attr: <template test=\"a\" abcd=\"b\">.tagName returned template"
script.c:624: Test failed: L"index.html?7:createElement_inline_attr: <foo test=\"a\" abcd=\"b\">.tagName returned foo"
script.c:624: Test failed: L"index.html?8:createElement_inline_attr: <template test=\"a\" abcd=\"b\">.tagName returned template"
script.c:624: Test failed: L"index.html?8:createElement_inline_attr: <foo test=\"a\" abcd=\"b\">.tagName returned foo"
=== w10pro64_ar (64 bit report) ===
mshtml:
script.c:624: Test failed: L"index.html?0:createElement_inline_attr: <template test=\"a\" abcd=\"b\">.tagName returned template"
script.c:624: Test failed: L"index.html?0:createElement_inline_attr: <foo test=\"a\" abcd=\"b\">.tagName returned foo"
script.c:624: Test failed: L"index.html?5:createElement_inline_attr: <template test=\"a\" abcd=\"b\">.tagName returned template"
script.c:624: Test failed: L"index.html?5:createElement_inline_attr: <foo test=\"a\" abcd=\"b\">.tagName returned foo"
script.c:624: Test failed: L"index.html?5:createElement_inline_attr: <template test=\"a\" abcd=\"b\">.tagName returned template"
script.c:624: Test failed: L"index.html?5:createElement_inline_attr: <foo test=\"a\" abcd=\"b\">.tagName returned foo"
script.c:624: Test failed: L"index.html?7:createElement_inline_attr: <template test=\"a\" abcd=\"b\">.tagName returned template"
script.c:624: Test failed: L"index.html?7:createElement_inline_attr: <foo test=\"a\" abcd=\"b\">.tagName returned foo"
script.c:624: Test failed: L"index.html?8:createElement_inline_attr: <template test=\"a\" abcd=\"b\">.tagName returned template"
script.c:624: Test failed: L"index.html?8:createElement_inline_attr: <foo test=\"a\" abcd=\"b\">.tagName returned foo"
=== w10pro64_he (64 bit report) ===
mshtml:
script.c:624: Test failed: L"index.html?0:createElement_inline_attr: <template test=\"a\" abcd=\"b\">.tagName returned template"
script.c:624: Test failed: L"index.html?0:createElement_inline_attr: <foo test=\"a\" abcd=\"b\">.tagName returned foo"
script.c:624: Test failed: L"index.html?5:createElement_inline_attr: <template test=\"a\" abcd=\"b\">.tagName returned template"
script.c:624: Test failed: L"index.html?5:createElement_inline_attr: <foo test=\"a\" abcd=\"b\">.tagName returned foo"
script.c:624: Test failed: L"index.html?5:createElement_inline_attr: <template test=\"a\" abcd=\"b\">.tagName returned template"
script.c:624: Test failed: L"index.html?5:createElement_inline_attr: <foo test=\"a\" abcd=\"b\">.tagName returned foo"
script.c:624: Test failed: L"index.html?7:createElement_inline_attr: <template test=\"a\" abcd=\"b\">.tagName returned template"
script.c:624: Test failed: L"index.html?7:createElement_inline_attr: <foo test=\"a\" abcd=\"b\">.tagName returned foo"
script.c:624: Test failed: L"index.html?8:createElement_inline_attr: <template test=\"a\" abcd=\"b\">.tagName returned template"
script.c:624: Test failed: L"index.html?8:createElement_inline_attr: <foo test=\"a\" abcd=\"b\">.tagName returned foo"
=== w10pro64_ja (64 bit report) ===
mshtml:
script.c:624: Test failed: L"index.html?0:createElement_inline_attr: <template test=\"a\" abcd=\"b\">.tagName returned template"
script.c:624: Test failed: L"index.html?0:createElement_inline_attr: <foo test=\"a\" abcd=\"b\">.tagName returned foo"
script.c:624: Test failed: L"index.html?5:createElement_inline_attr: <template test=\"a\" abcd=\"b\">.tagName returned template"
script.c:624: Test failed: L"index.html?5:createElement_inline_attr: <foo test=\"a\" abcd=\"b\">.tagName returned foo"
script.c:624: Test failed: L"index.html?5:createElement_inline_attr: <template test=\"a\" abcd=\"b\">.tagName returned template"
script.c:624: Test failed: L"index.html?5:createElement_inline_attr: <foo test=\"a\" abcd=\"b\">.tagName returned foo"
script.c:624: Test failed: L"index.html?7:createElement_inline_attr: <template test=\"a\" abcd=\"b\">.tagName returned template"
script.c:624: Test failed: L"index.html?7:createElement_inline_attr: <foo test=\"a\" abcd=\"b\">.tagName returned foo"
script.c:624: Test failed: L"index.html?8:createElement_inline_attr: <template test=\"a\" abcd=\"b\">.tagName returned template"
script.c:624: Test failed: L"index.html?8:createElement_inline_attr: <foo test=\"a\" abcd=\"b\">.tagName returned foo"
=== w10pro64_zh_CN (64 bit report) ===
mshtml:
script.c:624: Test failed: L"index.html?0:createElement_inline_attr: <template test=\"a\" abcd=\"b\">.tagName returned template"
script.c:624: Test failed: L"index.html?0:createElement_inline_attr: <foo test=\"a\" abcd=\"b\">.tagName returned foo"
script.c:624: Test failed: L"index.html?5:createElement_inline_attr: <template test=\"a\" abcd=\"b\">.tagName returned template"
script.c:624: Test failed: L"index.html?5:createElement_inline_attr: <foo test=\"a\" abcd=\"b\">.tagName returned foo"
script.c:624: Test failed: L"index.html?5:createElement_inline_attr: <template test=\"a\" abcd=\"b\">.tagName returned template"
script.c:624: Test failed: L"index.html?5:createElement_inline_attr: <foo test=\"a\" abcd=\"b\">.tagName returned foo"
script.c:624: Test failed: L"index.html?7:createElement_inline_attr: <template test=\"a\" abcd=\"b\">.tagName returned template"
script.c:624: Test failed: L"index.html?7:createElement_inline_attr: <foo test=\"a\" abcd=\"b\">.tagName returned foo"
script.c:624: Test failed: L"index.html?8:createElement_inline_attr: <template test=\"a\" abcd=\"b\">.tagName returned template"
script.c:624: Test failed: L"index.html?8:createElement_inline_attr: <foo test=\"a\" abcd=\"b\">.tagName returned foo"
Nov. 9, 2021
Re: [PATCH v4 1/2] mshtml: Implement inline attributes parsing for createElement.
by Marvin
Hi,
While running your changed tests, I think I found new failures.
Being a bot and all I'm not very good at pattern recognition, so I might be
wrong, but could you please double-check?
Full results can be found at:
https://testbot.winehq.org/JobDetails.pl?Key=101571
Your paranoid android.
=== w8adm (32 bit report) ===
mshtml:
events.c:1089: Test failed: unexpected call img_onerror
events: Timeout
=== w8adm (32 bit report) ===
mshtml:
htmldoc.c:3084: Test failed: Incorrect error code: -2146697211
htmldoc.c:3089: Test failed: Page address: L"http://test.winehq.org/tests/winehq_snapshot/"
htmldoc.c:5861: Test failed: expected OnChanged_1012
htmldoc.c:5862: Test failed: expected Exec_HTTPEQUIV
htmldoc.c:5864: Test failed: expected Exec_SETTITLE
htmldoc.c:5905: Test failed: expected FireNavigateComplete2
=== w10pro64_zh_CN (64 bit report) ===
mshtml:
htmldoc.c:2541: Test failed: unexpected call UpdateUI
htmldoc.c:2853: Test failed: unexpected call Exec_UPDATECOMMANDS
=== w7u_2qxl (32 bit report) ===
mshtml:
script.c:624: Test failed: L"index.html?0:createElement_inline_attr: <template test=\"a\" abcd=\"b\">.tagName returned template"
script.c:624: Test failed: L"index.html?0:createElement_inline_attr: <foo test=\"a\" abcd=\"b\">.tagName returned foo"
script.c:624: Test failed: L"index.html?5:createElement_inline_attr: <template test=\"a\" abcd=\"b\">.tagName returned template"
script.c:624: Test failed: L"index.html?5:createElement_inline_attr: <foo test=\"a\" abcd=\"b\">.tagName returned foo"
script.c:624: Test failed: L"index.html?5:createElement_inline_attr: <template test=\"a\" abcd=\"b\">.tagName returned template"
script.c:624: Test failed: L"index.html?5:createElement_inline_attr: <foo test=\"a\" abcd=\"b\">.tagName returned foo"
script.c:624: Test failed: L"index.html?7:createElement_inline_attr: <template test=\"a\" abcd=\"b\">.tagName returned template"
script.c:624: Test failed: L"index.html?7:createElement_inline_attr: <foo test=\"a\" abcd=\"b\">.tagName returned foo"
script.c:624: Test failed: L"index.html?8:createElement_inline_attr: <template test=\"a\" abcd=\"b\">.tagName returned template"
script.c:624: Test failed: L"index.html?8:createElement_inline_attr: <foo test=\"a\" abcd=\"b\">.tagName returned foo"
=== w7u_adm (32 bit report) ===
mshtml:
script.c:624: Test failed: L"index.html?0:createElement_inline_attr: <template test=\"a\" abcd=\"b\">.tagName returned template"
script.c:624: Test failed: L"index.html?0:createElement_inline_attr: <foo test=\"a\" abcd=\"b\">.tagName returned foo"
script.c:624: Test failed: L"index.html?5:createElement_inline_attr: <template test=\"a\" abcd=\"b\">.tagName returned template"
script.c:624: Test failed: L"index.html?5:createElement_inline_attr: <foo test=\"a\" abcd=\"b\">.tagName returned foo"
script.c:624: Test failed: L"index.html?5:createElement_inline_attr: <template test=\"a\" abcd=\"b\">.tagName returned template"
script.c:624: Test failed: L"index.html?5:createElement_inline_attr: <foo test=\"a\" abcd=\"b\">.tagName returned foo"
script.c:624: Test failed: L"index.html?7:createElement_inline_attr: <template test=\"a\" abcd=\"b\">.tagName returned template"
script.c:624: Test failed: L"index.html?7:createElement_inline_attr: <foo test=\"a\" abcd=\"b\">.tagName returned foo"
script.c:624: Test failed: L"index.html?8:createElement_inline_attr: <template test=\"a\" abcd=\"b\">.tagName returned template"
script.c:624: Test failed: L"index.html?8:createElement_inline_attr: <foo test=\"a\" abcd=\"b\">.tagName returned foo"
=== w7u_el (32 bit report) ===
mshtml:
script.c:624: Test failed: L"index.html?0:createElement_inline_attr: <template test=\"a\" abcd=\"b\">.tagName returned template"
script.c:624: Test failed: L"index.html?0:createElement_inline_attr: <foo test=\"a\" abcd=\"b\">.tagName returned foo"
script.c:624: Test failed: L"index.html?5:createElement_inline_attr: <template test=\"a\" abcd=\"b\">.tagName returned template"
script.c:624: Test failed: L"index.html?5:createElement_inline_attr: <foo test=\"a\" abcd=\"b\">.tagName returned foo"
script.c:624: Test failed: L"index.html?5:createElement_inline_attr: <template test=\"a\" abcd=\"b\">.tagName returned template"
script.c:624: Test failed: L"index.html?5:createElement_inline_attr: <foo test=\"a\" abcd=\"b\">.tagName returned foo"
script.c:624: Test failed: L"index.html?7:createElement_inline_attr: <template test=\"a\" abcd=\"b\">.tagName returned template"
script.c:624: Test failed: L"index.html?7:createElement_inline_attr: <foo test=\"a\" abcd=\"b\">.tagName returned foo"
script.c:624: Test failed: L"index.html?8:createElement_inline_attr: <template test=\"a\" abcd=\"b\">.tagName returned template"
script.c:624: Test failed: L"index.html?8:createElement_inline_attr: <foo test=\"a\" abcd=\"b\">.tagName returned foo"
=== w8 (32 bit report) ===
mshtml:
script.c:624: Test failed: L"index.html?0:createElement_inline_attr: <template test=\"a\" abcd=\"b\">.tagName returned template"
script.c:624: Test failed: L"index.html?0:createElement_inline_attr: <foo test=\"a\" abcd=\"b\">.tagName returned foo"
script.c:624: Test failed: L"index.html?5:createElement_inline_attr: <template test=\"a\" abcd=\"b\">.tagName returned template"
script.c:624: Test failed: L"index.html?5:createElement_inline_attr: <foo test=\"a\" abcd=\"b\">.tagName returned foo"
script.c:624: Test failed: L"index.html?5:createElement_inline_attr: <template test=\"a\" abcd=\"b\">.tagName returned template"
script.c:624: Test failed: L"index.html?5:createElement_inline_attr: <foo test=\"a\" abcd=\"b\">.tagName returned foo"
script.c:624: Test failed: L"index.html?7:createElement_inline_attr: <template test=\"a\" abcd=\"b\">.tagName returned template"
script.c:624: Test failed: L"index.html?7:createElement_inline_attr: <foo test=\"a\" abcd=\"b\">.tagName returned foo"
script.c:624: Test failed: L"index.html?8:createElement_inline_attr: <template test=\"a\" abcd=\"b\">.tagName returned template"
script.c:624: Test failed: L"index.html?8:createElement_inline_attr: <foo test=\"a\" abcd=\"b\">.tagName returned foo"
=== w8adm (32 bit report) ===
mshtml:
script.c:624: Test failed: L"index.html?0:createElement_inline_attr: <template test=\"a\" abcd=\"b\">.tagName returned template"
script.c:624: Test failed: L"index.html?0:createElement_inline_attr: <foo test=\"a\" abcd=\"b\">.tagName returned foo"
script.c:624: Test failed: L"index.html?5:createElement_inline_attr: <template test=\"a\" abcd=\"b\">.tagName returned template"
script.c:624: Test failed: L"index.html?5:createElement_inline_attr: <foo test=\"a\" abcd=\"b\">.tagName returned foo"
script.c:624: Test failed: L"index.html?5:createElement_inline_attr: <template test=\"a\" abcd=\"b\">.tagName returned template"
script.c:624: Test failed: L"index.html?5:createElement_inline_attr: <foo test=\"a\" abcd=\"b\">.tagName returned foo"
script.c:624: Test failed: L"index.html?7:createElement_inline_attr: <template test=\"a\" abcd=\"b\">.tagName returned template"
script.c:624: Test failed: L"index.html?7:createElement_inline_attr: <foo test=\"a\" abcd=\"b\">.tagName returned foo"
script.c:624: Test failed: L"index.html?8:createElement_inline_attr: <template test=\"a\" abcd=\"b\">.tagName returned template"
script.c:624: Test failed: L"index.html?8:createElement_inline_attr: <foo test=\"a\" abcd=\"b\">.tagName returned foo"
=== w864 (32 bit report) ===
mshtml:
script.c:624: Test failed: L"index.html?0:createElement_inline_attr: <template test=\"a\" abcd=\"b\">.tagName returned template"
script.c:624: Test failed: L"index.html?0:createElement_inline_attr: <foo test=\"a\" abcd=\"b\">.tagName returned foo"
script.c:624: Test failed: L"index.html?5:createElement_inline_attr: <template test=\"a\" abcd=\"b\">.tagName returned template"
script.c:624: Test failed: L"index.html?5:createElement_inline_attr: <foo test=\"a\" abcd=\"b\">.tagName returned foo"
script.c:624: Test failed: L"index.html?5:createElement_inline_attr: <template test=\"a\" abcd=\"b\">.tagName returned template"
script.c:624: Test failed: L"index.html?5:createElement_inline_attr: <foo test=\"a\" abcd=\"b\">.tagName returned foo"
script.c:624: Test failed: L"index.html?7:createElement_inline_attr: <template test=\"a\" abcd=\"b\">.tagName returned template"
script.c:624: Test failed: L"index.html?7:createElement_inline_attr: <foo test=\"a\" abcd=\"b\">.tagName returned foo"
script.c:624: Test failed: L"index.html?8:createElement_inline_attr: <template test=\"a\" abcd=\"b\">.tagName returned template"
script.c:624: Test failed: L"index.html?8:createElement_inline_attr: <foo test=\"a\" abcd=\"b\">.tagName returned foo"
=== w1064v1507 (32 bit report) ===
mshtml:
script.c:624: Test failed: L"index.html?0:createElement_inline_attr: <template test=\"a\" abcd=\"b\">.tagName returned template"
script.c:624: Test failed: L"index.html?0:createElement_inline_attr: <foo test=\"a\" abcd=\"b\">.tagName returned foo"
script.c:624: Test failed: L"index.html?5:createElement_inline_attr: <template test=\"a\" abcd=\"b\">.tagName returned template"
script.c:624: Test failed: L"index.html?5:createElement_inline_attr: <foo test=\"a\" abcd=\"b\">.tagName returned foo"
script.c:624: Test failed: L"index.html?5:createElement_inline_attr: <template test=\"a\" abcd=\"b\">.tagName returned template"
script.c:624: Test failed: L"index.html?5:createElement_inline_attr: <foo test=\"a\" abcd=\"b\">.tagName returned foo"
script.c:624: Test failed: L"index.html?7:createElement_inline_attr: <template test=\"a\" abcd=\"b\">.tagName returned template"
script.c:624: Test failed: L"index.html?7:createElement_inline_attr: <foo test=\"a\" abcd=\"b\">.tagName returned foo"
script.c:624: Test failed: L"index.html?8:createElement_inline_attr: <template test=\"a\" abcd=\"b\">.tagName returned template"
script.c:624: Test failed: L"index.html?8:createElement_inline_attr: <foo test=\"a\" abcd=\"b\">.tagName returned foo"
=== w1064v1809 (32 bit report) ===
mshtml:
script.c:624: Test failed: L"index.html?0:createElement_inline_attr: <template test=\"a\" abcd=\"b\">.tagName returned template"
script.c:624: Test failed: L"index.html?0:createElement_inline_attr: <foo test=\"a\" abcd=\"b\">.tagName returned foo"
script.c:624: Test failed: L"index.html?5:createElement_inline_attr: <template test=\"a\" abcd=\"b\">.tagName returned template"
script.c:624: Test failed: L"index.html?5:createElement_inline_attr: <foo test=\"a\" abcd=\"b\">.tagName returned foo"
script.c:624: Test failed: L"index.html?5:createElement_inline_attr: <template test=\"a\" abcd=\"b\">.tagName returned template"
script.c:624: Test failed: L"index.html?5:createElement_inline_attr: <foo test=\"a\" abcd=\"b\">.tagName returned foo"
script.c:624: Test failed: L"index.html?7:createElement_inline_attr: <template test=\"a\" abcd=\"b\">.tagName returned template"
script.c:624: Test failed: L"index.html?7:createElement_inline_attr: <foo test=\"a\" abcd=\"b\">.tagName returned foo"
script.c:624: Test failed: L"index.html?8:createElement_inline_attr: <template test=\"a\" abcd=\"b\">.tagName returned template"
script.c:624: Test failed: L"index.html?8:createElement_inline_attr: <foo test=\"a\" abcd=\"b\">.tagName returned foo"
=== w1064 (32 bit report) ===
mshtml:
script.c:624: Test failed: L"index.html?0:createElement_inline_attr: <template test=\"a\" abcd=\"b\">.tagName returned template"
script.c:624: Test failed: L"index.html?0:createElement_inline_attr: <foo test=\"a\" abcd=\"b\">.tagName returned foo"
script.c:624: Test failed: L"index.html?5:createElement_inline_attr: <template test=\"a\" abcd=\"b\">.tagName returned template"
script.c:624: Test failed: L"index.html?5:createElement_inline_attr: <foo test=\"a\" abcd=\"b\">.tagName returned foo"
script.c:624: Test failed: L"index.html?5:createElement_inline_attr: <template test=\"a\" abcd=\"b\">.tagName returned template"
script.c:624: Test failed: L"index.html?5:createElement_inline_attr: <foo test=\"a\" abcd=\"b\">.tagName returned foo"
script.c:624: Test failed: L"index.html?7:createElement_inline_attr: <template test=\"a\" abcd=\"b\">.tagName returned template"
script.c:624: Test failed: L"index.html?7:createElement_inline_attr: <foo test=\"a\" abcd=\"b\">.tagName returned foo"
script.c:624: Test failed: L"index.html?8:createElement_inline_attr: <template test=\"a\" abcd=\"b\">.tagName returned template"
script.c:624: Test failed: L"index.html?8:createElement_inline_attr: <foo test=\"a\" abcd=\"b\">.tagName returned foo"
=== w1064_tsign (32 bit report) ===
mshtml:
script.c:624: Test failed: L"index.html?0:createElement_inline_attr: <template test=\"a\" abcd=\"b\">.tagName returned template"
script.c:624: Test failed: L"index.html?0:createElement_inline_attr: <foo test=\"a\" abcd=\"b\">.tagName returned foo"
script.c:624: Test failed: L"index.html?5:createElement_inline_attr: <template test=\"a\" abcd=\"b\">.tagName returned template"
script.c:624: Test failed: L"index.html?5:createElement_inline_attr: <foo test=\"a\" abcd=\"b\">.tagName returned foo"
script.c:624: Test failed: L"index.html?5:createElement_inline_attr: <template test=\"a\" abcd=\"b\">.tagName returned template"
script.c:624: Test failed: L"index.html?5:createElement_inline_attr: <foo test=\"a\" abcd=\"b\">.tagName returned foo"
script.c:624: Test failed: L"index.html?7:createElement_inline_attr: <template test=\"a\" abcd=\"b\">.tagName returned template"
script.c:624: Test failed: L"index.html?7:createElement_inline_attr: <foo test=\"a\" abcd=\"b\">.tagName returned foo"
script.c:624: Test failed: L"index.html?8:createElement_inline_attr: <template test=\"a\" abcd=\"b\">.tagName returned template"
script.c:624: Test failed: L"index.html?8:createElement_inline_attr: <foo test=\"a\" abcd=\"b\">.tagName returned foo"
=== w10pro64 (32 bit report) ===
mshtml:
script.c:624: Test failed: L"index.html?0:createElement_inline_attr: <template test=\"a\" abcd=\"b\">.tagName returned template"
script.c:624: Test failed: L"index.html?0:createElement_inline_attr: <foo test=\"a\" abcd=\"b\">.tagName returned foo"
script.c:624: Test failed: L"index.html?5:createElement_inline_attr: <template test=\"a\" abcd=\"b\">.tagName returned template"
script.c:624: Test failed: L"index.html?5:createElement_inline_attr: <foo test=\"a\" abcd=\"b\">.tagName returned foo"
script.c:624: Test failed: L"index.html?5:createElement_inline_attr: <template test=\"a\" abcd=\"b\">.tagName returned template"
script.c:624: Test failed: L"index.html?5:createElement_inline_attr: <foo test=\"a\" abcd=\"b\">.tagName returned foo"
script.c:624: Test failed: L"index.html?7:createElement_inline_attr: <template test=\"a\" abcd=\"b\">.tagName returned template"
script.c:624: Test failed: L"index.html?7:createElement_inline_attr: <foo test=\"a\" abcd=\"b\">.tagName returned foo"
script.c:624: Test failed: L"index.html?8:createElement_inline_attr: <template test=\"a\" abcd=\"b\">.tagName returned template"
script.c:624: Test failed: L"index.html?8:createElement_inline_attr: <foo test=\"a\" abcd=\"b\">.tagName returned foo"
=== w864 (64 bit report) ===
mshtml:
script.c:624: Test failed: L"index.html?0:createElement_inline_attr: <template test=\"a\" abcd=\"b\">.tagName returned template"
script.c:624: Test failed: L"index.html?0:createElement_inline_attr: <foo test=\"a\" abcd=\"b\">.tagName returned foo"
script.c:624: Test failed: L"index.html?5:createElement_inline_attr: <template test=\"a\" abcd=\"b\">.tagName returned template"
script.c:624: Test failed: L"index.html?5:createElement_inline_attr: <foo test=\"a\" abcd=\"b\">.tagName returned foo"
script.c:624: Test failed: L"index.html?5:createElement_inline_attr: <template test=\"a\" abcd=\"b\">.tagName returned template"
script.c:624: Test failed: L"index.html?5:createElement_inline_attr: <foo test=\"a\" abcd=\"b\">.tagName returned foo"
script.c:624: Test failed: L"index.html?7:createElement_inline_attr: <template test=\"a\" abcd=\"b\">.tagName returned template"
script.c:624: Test failed: L"index.html?7:createElement_inline_attr: <foo test=\"a\" abcd=\"b\">.tagName returned foo"
script.c:624: Test failed: L"index.html?8:createElement_inline_attr: <template test=\"a\" abcd=\"b\">.tagName returned template"
script.c:624: Test failed: L"index.html?8:createElement_inline_attr: <foo test=\"a\" abcd=\"b\">.tagName returned foo"
=== w1064v1507 (64 bit report) ===
mshtml:
script.c:624: Test failed: L"index.html?0:createElement_inline_attr: <template test=\"a\" abcd=\"b\">.tagName returned template"
script.c:624: Test failed: L"index.html?0:createElement_inline_attr: <foo test=\"a\" abcd=\"b\">.tagName returned foo"
script.c:624: Test failed: L"index.html?5:createElement_inline_attr: <template test=\"a\" abcd=\"b\">.tagName returned template"
script.c:624: Test failed: L"index.html?5:createElement_inline_attr: <foo test=\"a\" abcd=\"b\">.tagName returned foo"
script.c:624: Test failed: L"index.html?5:createElement_inline_attr: <template test=\"a\" abcd=\"b\">.tagName returned template"
script.c:624: Test failed: L"index.html?5:createElement_inline_attr: <foo test=\"a\" abcd=\"b\">.tagName returned foo"
script.c:624: Test failed: L"index.html?7:createElement_inline_attr: <template test=\"a\" abcd=\"b\">.tagName returned template"
script.c:624: Test failed: L"index.html?7:createElement_inline_attr: <foo test=\"a\" abcd=\"b\">.tagName returned foo"
script.c:624: Test failed: L"index.html?8:createElement_inline_attr: <template test=\"a\" abcd=\"b\">.tagName returned template"
script.c:624: Test failed: L"index.html?8:createElement_inline_attr: <foo test=\"a\" abcd=\"b\">.tagName returned foo"
=== w1064v1809 (64 bit report) ===
mshtml:
script.c:624: Test failed: L"index.html?0:createElement_inline_attr: <template test=\"a\" abcd=\"b\">.tagName returned template"
script.c:624: Test failed: L"index.html?0:createElement_inline_attr: <foo test=\"a\" abcd=\"b\">.tagName returned foo"
script.c:624: Test failed: L"index.html?5:createElement_inline_attr: <template test=\"a\" abcd=\"b\">.tagName returned template"
script.c:624: Test failed: L"index.html?5:createElement_inline_attr: <foo test=\"a\" abcd=\"b\">.tagName returned foo"
script.c:624: Test failed: L"index.html?5:createElement_inline_attr: <template test=\"a\" abcd=\"b\">.tagName returned template"
script.c:624: Test failed: L"index.html?5:createElement_inline_attr: <foo test=\"a\" abcd=\"b\">.tagName returned foo"
script.c:624: Test failed: L"index.html?7:createElement_inline_attr: <template test=\"a\" abcd=\"b\">.tagName returned template"
script.c:624: Test failed: L"index.html?7:createElement_inline_attr: <foo test=\"a\" abcd=\"b\">.tagName returned foo"
script.c:624: Test failed: L"index.html?8:createElement_inline_attr: <template test=\"a\" abcd=\"b\">.tagName returned template"
script.c:624: Test failed: L"index.html?8:createElement_inline_attr: <foo test=\"a\" abcd=\"b\">.tagName returned foo"
=== w1064 (64 bit report) ===
mshtml:
script.c:624: Test failed: L"index.html?0:createElement_inline_attr: <template test=\"a\" abcd=\"b\">.tagName returned template"
script.c:624: Test failed: L"index.html?0:createElement_inline_attr: <foo test=\"a\" abcd=\"b\">.tagName returned foo"
script.c:624: Test failed: L"index.html?5:createElement_inline_attr: <template test=\"a\" abcd=\"b\">.tagName returned template"
script.c:624: Test failed: L"index.html?5:createElement_inline_attr: <foo test=\"a\" abcd=\"b\">.tagName returned foo"
script.c:624: Test failed: L"index.html?5:createElement_inline_attr: <template test=\"a\" abcd=\"b\">.tagName returned template"
script.c:624: Test failed: L"index.html?5:createElement_inline_attr: <foo test=\"a\" abcd=\"b\">.tagName returned foo"
script.c:624: Test failed: L"index.html?7:createElement_inline_attr: <template test=\"a\" abcd=\"b\">.tagName returned template"
script.c:624: Test failed: L"index.html?7:createElement_inline_attr: <foo test=\"a\" abcd=\"b\">.tagName returned foo"
script.c:624: Test failed: L"index.html?8:createElement_inline_attr: <template test=\"a\" abcd=\"b\">.tagName returned template"
script.c:624: Test failed: L"index.html?8:createElement_inline_attr: <foo test=\"a\" abcd=\"b\">.tagName returned foo"
=== w1064_2qxl (64 bit report) ===
mshtml:
script.c:624: Test failed: L"index.html?0:createElement_inline_attr: <template test=\"a\" abcd=\"b\">.tagName returned template"
script.c:624: Test failed: L"index.html?0:createElement_inline_attr: <foo test=\"a\" abcd=\"b\">.tagName returned foo"
script.c:624: Test failed: L"index.html?5:createElement_inline_attr: <template test=\"a\" abcd=\"b\">.tagName returned template"
script.c:624: Test failed: L"index.html?5:createElement_inline_attr: <foo test=\"a\" abcd=\"b\">.tagName returned foo"
script.c:624: Test failed: L"index.html?5:createElement_inline_attr: <template test=\"a\" abcd=\"b\">.tagName returned template"
script.c:624: Test failed: L"index.html?5:createElement_inline_attr: <foo test=\"a\" abcd=\"b\">.tagName returned foo"
script.c:624: Test failed: L"index.html?7:createElement_inline_attr: <template test=\"a\" abcd=\"b\">.tagName returned template"
script.c:624: Test failed: L"index.html?7:createElement_inline_attr: <foo test=\"a\" abcd=\"b\">.tagName returned foo"
script.c:624: Test failed: L"index.html?8:createElement_inline_attr: <template test=\"a\" abcd=\"b\">.tagName returned template"
script.c:624: Test failed: L"index.html?8:createElement_inline_attr: <foo test=\"a\" abcd=\"b\">.tagName returned foo"
=== w1064_tsign (64 bit report) ===
mshtml:
script.c:624: Test failed: L"index.html?0:createElement_inline_attr: <template test=\"a\" abcd=\"b\">.tagName returned template"
script.c:624: Test failed: L"index.html?0:createElement_inline_attr: <foo test=\"a\" abcd=\"b\">.tagName returned foo"
script.c:624: Test failed: L"index.html?5:createElement_inline_attr: <template test=\"a\" abcd=\"b\">.tagName returned template"
script.c:624: Test failed: L"index.html?5:createElement_inline_attr: <foo test=\"a\" abcd=\"b\">.tagName returned foo"
script.c:624: Test failed: L"index.html?5:createElement_inline_attr: <template test=\"a\" abcd=\"b\">.tagName returned template"
script.c:624: Test failed: L"index.html?5:createElement_inline_attr: <foo test=\"a\" abcd=\"b\">.tagName returned foo"
script.c:624: Test failed: L"index.html?7:createElement_inline_attr: <template test=\"a\" abcd=\"b\">.tagName returned template"
script.c:624: Test failed: L"index.html?7:createElement_inline_attr: <foo test=\"a\" abcd=\"b\">.tagName returned foo"
script.c:624: Test failed: L"index.html?8:createElement_inline_attr: <template test=\"a\" abcd=\"b\">.tagName returned template"
script.c:624: Test failed: L"index.html?8:createElement_inline_attr: <foo test=\"a\" abcd=\"b\">.tagName returned foo"
=== w10pro64 (64 bit report) ===
mshtml:
script.c:624: Test failed: L"index.html?0:createElement_inline_attr: <template test=\"a\" abcd=\"b\">.tagName returned template"
script.c:624: Test failed: L"index.html?0:createElement_inline_attr: <foo test=\"a\" abcd=\"b\">.tagName returned foo"
script.c:624: Test failed: L"index.html?5:createElement_inline_attr: <template test=\"a\" abcd=\"b\">.tagName returned template"
script.c:624: Test failed: L"index.html?5:createElement_inline_attr: <foo test=\"a\" abcd=\"b\">.tagName returned foo"
script.c:624: Test failed: L"index.html?5:createElement_inline_attr: <template test=\"a\" abcd=\"b\">.tagName returned template"
script.c:624: Test failed: L"index.html?5:createElement_inline_attr: <foo test=\"a\" abcd=\"b\">.tagName returned foo"
script.c:624: Test failed: L"index.html?7:createElement_inline_attr: <template test=\"a\" abcd=\"b\">.tagName returned template"
script.c:624: Test failed: L"index.html?7:createElement_inline_attr: <foo test=\"a\" abcd=\"b\">.tagName returned foo"
script.c:624: Test failed: L"index.html?8:createElement_inline_attr: <template test=\"a\" abcd=\"b\">.tagName returned template"
script.c:624: Test failed: L"index.html?8:createElement_inline_attr: <foo test=\"a\" abcd=\"b\">.tagName returned foo"
=== w10pro64_ar (64 bit report) ===
mshtml:
script.c:624: Test failed: L"index.html?0:createElement_inline_attr: <template test=\"a\" abcd=\"b\">.tagName returned template"
script.c:624: Test failed: L"index.html?0:createElement_inline_attr: <foo test=\"a\" abcd=\"b\">.tagName returned foo"
script.c:624: Test failed: L"index.html?5:createElement_inline_attr: <template test=\"a\" abcd=\"b\">.tagName returned template"
script.c:624: Test failed: L"index.html?5:createElement_inline_attr: <foo test=\"a\" abcd=\"b\">.tagName returned foo"
script.c:624: Test failed: L"index.html?5:createElement_inline_attr: <template test=\"a\" abcd=\"b\">.tagName returned template"
script.c:624: Test failed: L"index.html?5:createElement_inline_attr: <foo test=\"a\" abcd=\"b\">.tagName returned foo"
script.c:624: Test failed: L"index.html?7:createElement_inline_attr: <template test=\"a\" abcd=\"b\">.tagName returned template"
script.c:624: Test failed: L"index.html?7:createElement_inline_attr: <foo test=\"a\" abcd=\"b\">.tagName returned foo"
script.c:624: Test failed: L"index.html?8:createElement_inline_attr: <template test=\"a\" abcd=\"b\">.tagName returned template"
script.c:624: Test failed: L"index.html?8:createElement_inline_attr: <foo test=\"a\" abcd=\"b\">.tagName returned foo"
=== w10pro64_he (64 bit report) ===
mshtml:
script.c:624: Test failed: L"index.html?0:createElement_inline_attr: <template test=\"a\" abcd=\"b\">.tagName returned template"
script.c:624: Test failed: L"index.html?0:createElement_inline_attr: <foo test=\"a\" abcd=\"b\">.tagName returned foo"
script.c:624: Test failed: L"index.html?5:createElement_inline_attr: <template test=\"a\" abcd=\"b\">.tagName returned template"
script.c:624: Test failed: L"index.html?5:createElement_inline_attr: <foo test=\"a\" abcd=\"b\">.tagName returned foo"
script.c:624: Test failed: L"index.html?5:createElement_inline_attr: <template test=\"a\" abcd=\"b\">.tagName returned template"
script.c:624: Test failed: L"index.html?5:createElement_inline_attr: <foo test=\"a\" abcd=\"b\">.tagName returned foo"
script.c:624: Test failed: L"index.html?7:createElement_inline_attr: <template test=\"a\" abcd=\"b\">.tagName returned template"
script.c:624: Test failed: L"index.html?7:createElement_inline_attr: <foo test=\"a\" abcd=\"b\">.tagName returned foo"
script.c:624: Test failed: L"index.html?8:createElement_inline_attr: <template test=\"a\" abcd=\"b\">.tagName returned template"
script.c:624: Test failed: L"index.html?8:createElement_inline_attr: <foo test=\"a\" abcd=\"b\">.tagName returned foo"
=== w10pro64_ja (64 bit report) ===
mshtml:
script.c:624: Test failed: L"index.html?0:createElement_inline_attr: <template test=\"a\" abcd=\"b\">.tagName returned template"
script.c:624: Test failed: L"index.html?0:createElement_inline_attr: <foo test=\"a\" abcd=\"b\">.tagName returned foo"
script.c:624: Test failed: L"index.html?5:createElement_inline_attr: <template test=\"a\" abcd=\"b\">.tagName returned template"
script.c:624: Test failed: L"index.html?5:createElement_inline_attr: <foo test=\"a\" abcd=\"b\">.tagName returned foo"
script.c:624: Test failed: L"index.html?5:createElement_inline_attr: <template test=\"a\" abcd=\"b\">.tagName returned template"
script.c:624: Test failed: L"index.html?5:createElement_inline_attr: <foo test=\"a\" abcd=\"b\">.tagName returned foo"
script.c:624: Test failed: L"index.html?7:createElement_inline_attr: <template test=\"a\" abcd=\"b\">.tagName returned template"
script.c:624: Test failed: L"index.html?7:createElement_inline_attr: <foo test=\"a\" abcd=\"b\">.tagName returned foo"
script.c:624: Test failed: L"index.html?8:createElement_inline_attr: <template test=\"a\" abcd=\"b\">.tagName returned template"
script.c:624: Test failed: L"index.html?8:createElement_inline_attr: <foo test=\"a\" abcd=\"b\">.tagName returned foo"
=== w10pro64_zh_CN (64 bit report) ===
mshtml:
script.c:624: Test failed: L"index.html?0:createElement_inline_attr: <template test=\"a\" abcd=\"b\">.tagName returned template"
script.c:624: Test failed: L"index.html?0:createElement_inline_attr: <foo test=\"a\" abcd=\"b\">.tagName returned foo"
script.c:624: Test failed: L"index.html?5:createElement_inline_attr: <template test=\"a\" abcd=\"b\">.tagName returned template"
script.c:624: Test failed: L"index.html?5:createElement_inline_attr: <foo test=\"a\" abcd=\"b\">.tagName returned foo"
script.c:624: Test failed: L"index.html?5:createElement_inline_attr: <template test=\"a\" abcd=\"b\">.tagName returned template"
script.c:624: Test failed: L"index.html?5:createElement_inline_attr: <foo test=\"a\" abcd=\"b\">.tagName returned foo"
script.c:624: Test failed: L"index.html?7:createElement_inline_attr: <template test=\"a\" abcd=\"b\">.tagName returned template"
script.c:624: Test failed: L"index.html?7:createElement_inline_attr: <foo test=\"a\" abcd=\"b\">.tagName returned foo"
script.c:624: Test failed: L"index.html?8:createElement_inline_attr: <template test=\"a\" abcd=\"b\">.tagName returned template"
script.c:624: Test failed: L"index.html?8:createElement_inline_attr: <foo test=\"a\" abcd=\"b\">.tagName returned foo"
Nov. 9, 2021